{"text_format":"1","workbook":"xlsx","n_sheets":12,"sheets":["Cookies","Sheet3","Option Data","Sheet7","Sheet6","Sheet5","Main","Sheet4","Sheet1","Screener","Symbol List","Concept"],"not_rendered":{"charts":5,"images":0,"macros":1,"external_links":0,"defined_names":7,"comments":0,"pivot_tables":0},"unopened":[],"bounds":{"document_bytes":16777216,"sheet_cells":100000,"rows_first":2000,"rows_last":500,"rows_between":2000,"halvings":0,"cell_chars":16384,"cell_head_chars":4096},"cells_cut":0,"cells_raw":0,"read":"whole","date_system":"1900"}

{"sheet":"Cookies","index":0,"n_rows":2,"n_cols":2,"rows_kept":2,"cut":false,"hidden":false,"merged":[]}
[null,"Cookies"]
[null,"nsit=zsvG516E9TjxJ2rMhNWESgnw;AKA_A2=A;_abck=7EBF55BCFB2519B81CB74DDB5161A1D1~-1~YAAQZaXBF9baMGqdAQAAzDVDcQ8Tg2qyrHjjPU/Sfy9HaviCObGBE0WrHaDZvYjO5261mOsSGAS120/QGHWsoSDpYkajgbkAc6HpykncVEMFrUN7SBETgBkoB5AZYB+7xTzXdWNwlUIee/vjEwmJZrjMpHjBMB/4a54SqU3juz0Yk1ZrbIvwMn5d9HNvPLQ5A5PsfI8slR2r47fqkvO8a4B3oWznITDsWnLun5BgODJk5C8eTS08zPEOn7cKKfpskje5qqVtS4WWI4Ez247Om/6Z+5Ej1zZuofPqmjNwADG6tndV450kohDIik7GbbSxGdKRr4/ZF0GsDYK5sc7xuLEJvInTJtNo+wF95PmuiJ2zoQ5DaeacRYlb3I+euuHxgNNUQRH/d8mpyiztMHYIpoOrvp1oXIRyUkZC3uCSgkPKPscFRQByLDKnX+wL/S9BR/Q/PTp22WuDKA==~-1~-1~-1~-1~-1;bm_sz=C9FDF74D7F5404E2E39DB043961B7672~YAAQZaXBF9faMGqdAQAAzDVDcR/IvNtipd0WnB6YeWxSnPfZZ7TjHi8Ab551x8HPKcbPgpRa/XNOErSyuVxD2wVPZ2Cmpd5lQrUWHiHRdnMKG1m/3trQ2MGjcjGPjRuetHicnr5o6Hdshjx4qEA24kbzdFX7Rd+Ja6gEDNVi6yTflUdjRMbyHWo1AkZn2ptkM6yi9j4nzrobzjJb8Vrse5CD22LXFthe7sFTeEnrROD9uTca0l6rQFljbYsAFZ3SxCqsx3nTBSBtHOgJzozrtYNGmKryliylI3IBcBBvAazk0+KBigcrv7gVOzCLE6waqB83tOqn7wodbUgazsudVd8RIWrkIsevV5BvhPEqUnzBNZKT6Xi5MnTrxmgs/UUjE0+s8Q8P~3356213~3227961;"]

{"sheet":"Sheet3","index":1,"n_rows":2,"n_cols":1,"rows_kept":2,"cut":false,"hidden":true,"merged":[]}
["Invoked Function"]
["13-Apr-2026"]

{"sheet":"Option Data","index":2,"n_rows":280,"n_cols":27,"rows_kept":280,"cut":false,"hidden":true,"merged":[]}
[]
[]
[null,null,null,null,null,null,null,1,2,3,4,5,6,7,8]
[1,2,3,4,5,6,7]
[null,"PE OI","PE Chng in  OI","PE Volume","PE IV","PE LTP","PE Change","Strike Price","CE OI","CE Chng in OI","CE Volume","CE IV","CE LTP","CE P Change","Underlying Value"]
[{"$f":"IFERROR(OptionChain[[#This Row],[Strike Price]],\"\")","v":20100},49943,-11030,94457,58.34,1,-0.55000000000000004,20100,1,0,1,0,3742,-38,23767.200000000001]
[{"$f":"IFERROR(OptionChain[[#This Row],[Strike Price]],\"\")","v":20150},7253,413,10905,58.64,1.1000000000000001,-0.55000000000000004,20150,0,0,0,0,0,0,23767.200000000001]
[{"$f":"IFERROR(OptionChain[[#This Row],[Strike Price]],\"\")","v":20200},14247,-2692,24186,58.11,1.25,-0.4,20200,0,0,0,0,0,0,23767.200000000001]
[{"$f":"IFERROR(OptionChain[[#This Row],[Strike Price]],\"\")","v":20250},2892,-77,4329,57.33,1.3,-0.5,20250,1,0,0,0,0,0,23767.200000000001]
[{"$f":"IFERROR(OptionChain[[#This Row],[Strike Price]],\"\")","v":20300},7298,832,16934,56.78,1.35,-0.5,20300,0,0,0,0,0,0,23767.200000000001]
[{"$f":"IFERROR(OptionChain[[#This Row],[Strike Price]],\"\")","v":20350},1868,440,4514,55.99,1.25,-0.7,20350,0,0,0,0,0,0,23767.200000000001]
[{"$f":"IFERROR(OptionChain[[#This Row],[Strike Price]],\"\")","v":20400},2822,-269,11773,55.64,1.4,-0.6,20400,1,0,0,0,0,0,23767.200000000001]
[{"$f":"IFERROR(OptionChain[[#This Row],[Strike Price]],\"\")","v":20450},1099,369,3215,54.65,1.4,-0.7,20450,1,0,0,0,0,0,23767.200000000001]
[{"$f":"IFERROR(OptionChain[[#This Row],[Strike Price]],\"\")","v":20500},35637,-4209,55782,54.08,1.5,-0.7,20500,14,0,0,0,0,0,23767.200000000001]
[{"$f":"IFERROR(OptionChain[[#This Row],[Strike Price]],\"\")","v":20550},759,-8,1756,53.69,1.5,-0.8,20550,4,0,0,0,0,0,23767.200000000001]
{"$rows_left_out":266}
{"sheet":"Sheet7","index":3,"n_rows":2,"n_cols":1,"rows_kept":2,"cut":false,"hidden":true,"merged":[]}
["Invoked Function (3)"]
["13-Apr-2026"]

{"sheet":"Sheet6","index":4,"n_rows":2,"n_cols":1,"rows_kept":2,"cut":false,"hidden":true,"merged":[]}
["Column1"]
["2026-04-13"]

{"sheet":"Sheet5","index":5,"n_rows":2,"n_cols":1,"rows_kept":2,"cut":false,"hidden":true,"merged":[]}
["Column1"]
["2026-04-13"]

{"sheet":"Main","index":6,"n_rows":45,"n_cols":29,"rows_kept":45,"cut":false,"hidden":false,"merged":[[34,8,34,14],[34,16,34,24],[5,22,6,22],[5,23,6,23],[5,24,6,24],[24,19,24,21],[24,22,24,23],[5,0,5,9],[5,11,5,20],[3,10,5,10],[28,11,28,12],[5,21,6,21]]}
["Set Expiry","Column1",null,null,null,null,null,null,null,null,null,null,null,null,null,null,"Lot Size",{"$f":"VLOOKUP(Scrips,'Symbol List'!F3:G149,2,FALSE)","v":75}]
[null,"2026-04-13",null,null,"Symbol",null,"Option Type",null,null,null,"CMP"]
[null,null,null,null,"Scrips",null,"Option Type",null,null,null,"CMP"]
[null,null,null,null,"NIFTY",null,{"$f":"IF(OR(E4=\"NIFTY\",E4=\"BANKNIFTY\"),\"indices\",\"equities\")","v":"indices"},null,null,null,{"$f":"'Option Data'!O22","v":23767.200000000001},null,null,null,null,null,"Strike Diff",{"$f":"'Option Data'!H44-'Option Data'!H43","v":50}]
[]
["CALLS",null,null,null,null,null,null,null,null,null,null,"PUTS",null,null,null,null,null,null,null,null,null,"COIVR","POIVR","CE","PE"]
["VOLUME","OI","CHNG OI","INTERPRETATION","OI","CE CHNG IN OI","VOLUME","P.CHANGE","LTP","CE IV","STRIKE PRICE","PE IV","LTP","P.CHANGE","VOLUME","PE CHNG IN OI","OI","INTERPRETATION","CHNG OI","OI","VOLUME"]
[{"$f":"RANK(G8,$G$8:$G$24)","v":17},{"$f":"RANK(E8,$E$8:$E$24)","v":17},{"$f":"RANK(F8,$F$8:$F$24)","v":17},{"$f":"IF(AND(H8>0,F8>0),\"Long Buildup\",IF(AND(H8>0,F8<0),\"Short Covering\",IF(AND(H8<0,F8<0),\"Long Unwinding\",IF(AND(H8<0,F8>0),\"Short Buildup\",\"\"))))","v":"Long Unwinding"},{"$f":"IFERROR(VLOOKUP(K8,'Option Data'!$H$5:$M$170,2,FALSE)*Main!$R$1,\"\")","v":79275},{"$f":"IFERROR(VLOOKUP(K8,'Option Data'!$H$5:$M$170,3,FALSE)*Main!$R$1,\"\")","v":-20925},{"$f":"IFERROR(VLOOKUP(K8,'Option Data'!$H$5:$M$170,4,FALSE),\"\")","v":2082},{"$f":"IFERROR(VLOOKUP(K8,'Option Data'!$H$5:$N$171,7,FALSE),\"\")","v":-202.75},{"$f":"IFERROR(VLOOKUP(K8,'Option Data'!$H$5:$M$170,6,FALSE),\"\")","v":496.7},{"$f":"IFERROR(VLOOKUP(K8,'Option Data'!$H$5:$M$170,5,FALSE),\"\")","v":20.83},{"$f":"K9-$R$4","v":23350},{"$f":"IFERROR(VLOOKUP(K8,'Option Data'!A5:$I$251,5,FALSE),\"\")","v":22.3},{"$f":"IFERROR(VLOOKUP(K8,'Option Data'!A5:$I$251,6,FALSE),\"\")","v":70.75},{"$f":"IFERROR(VLOOKUP(K8,'Option Data'!A5:$I$251,7,FALSE),\"\")","v":23},{"$f":"IFERROR(VLOOKUP(K8,'Option Data'!A5:$I$251,4,FALSE),\"\")","v":199993},{"$f":"IFERROR(VLOOKUP(K8,'Option Data'!A5:$I$251,3,FALSE)*Main!$R$1,\"\")","v":183525},{"$f":"IFERROR(VLOOKUP(K8,'Option Data'!A5:$I$251,2,FALSE)*Main!$R$1,\"\")","v":943500},{"$f":"IF(AND(N8>0,P8>0),\"Long Buildup\",IF(AND(N8>0,P8<0),\"Short Covering\",IF(AND(N8<0,P8<0),\"Long Unwinding\",IF(AND(N8<0,P8>0),\"Short Buildup\",\"\"))))","v":"Long Buildup"},{"$f":"RANK(P8,$P$8:$P$24)","v":10},{"$f":"RANK(Q8,$Q$8:$Q$24)","v":13},{"$f":"RANK(O8,$O$8:$O$24)","v":14},{"$f":"IF(F8*F8>1000000,IFERROR(F8/G8,0),0)","v":-10.050432276657061},{"$f":"IF(P8*P8>1000000,IFERROR(P8/O8,0),0)","v":0.91765711799912997},{"$f":"E8/Q8","v":8.402225755166931E-2},{"$f":"Q8/E8","v":11.901608325449384}]
[{"$f":"RANK(G9,$G$8:$G$24)","v":15},{"$f":"RANK(E9,$E$8:$E$24)","v":13},{"$f":"RANK(F9,$F$8:$F$24)","v":16},{"$f":"IF(AND(H9>0,F9>0),\"Long Buildup\",IF(AND(H9>0,F9<0),\"Short Covering\",IF(AND(H9<0,F9<0),\"Long Unwinding\",IF(AND(H9<0,F9>0),\"Short Buildup\",\"\"))))","v":"Long Unwinding"},{"$f":"IFERROR(VLOOKUP(K9,'Option Data'!$H$5:$M$170,2,FALSE)*Main!$R$1,\"\")","v":335475},{"$f":"IFERROR(VLOOKUP(K9,'Option Data'!$H$5:$M$170,3,FALSE)*Main!$R$1,\"\")","v":-17850},{"$f":"IFERROR(VLOOKUP(K9,'Option Data'!$H$5:$M$170,4,FALSE),\"\")","v":9606},{"$f":"IFERROR(VLOOKUP(K9,'Option Data'!$H$5:$N$171,7,FALSE),\"\")","v":-200.5},{"$f":"IFERROR(VLOOKUP(K9,'Option Data'!$H$5:$M$170,6,FALSE),\"\")","v":456.95},{"$f":"IFERROR(VLOOKUP(K9,'Option Data'!$H$5:$M$170,5,FALSE),\"\")","v":20.68},23400,{"$f":"IFERROR(VLOOKUP(K9,'Option Data'!A6:$I$251,5,FALSE),\"\")","v":22.02},{"$f":"IFERROR(VLOOKUP(K9,'Option Data'!A6:$I$251,6,FALSE),\"\")","v":81},{"$f":"IFERROR(VLOOKUP(K9,'Option Data'!A6:$I$251,7,FALSE),\"\")","v":28.5},{"$f":"IFERROR(VLOOKUP(K9,'Option Data'!A6:$I$251,4,FALSE),\"\")","v":475888},{"$f":"IFERROR(VLOOKUP(K9,'Option Data'!A6:$I$251,3,FALSE)*Main!$R$1,\"\")","v":580650},{"$f":"IFERROR(VLOOKUP(K9,'Option Data'!A6:$I$251,2,FALSE)*Main!$R$1,\"\")","v":2445600},{"$f":"IF(AND(N9>0,P9>0),\"Long Buildup\",IF(AND(N9>0,P9<0),\"Short Covering\",IF(AND(N9<0,P9<0),\"Long Unwinding\",IF(AND(N9<0,P9>0),\"Short Buildup\",\"\"))))","v":"Long Buildup"},{"$f":"RANK(P9,$P$8:$P$24)","v":6},{"$f":"RANK(Q9,$Q$8:$Q$24)","v":7},{"$f":"RANK(O9,$O$8:$O$24)","v":10},{"$f":"IF(F9*F9>1000000,IFERROR(F9/G9,0),0)","v":-1.8582136164896939},{"$f":"IF(P9*P9>1000000,IFERROR(P9/O9,0),0)","v":1.2201400329489291},{"$f":"E9/Q9","v":0.13717492639842982},{"$f":"Q9/E9","v":7.2899619941873466}]
[16,16,15,"Short Buildup",{"$f":"IFERROR(VLOOKUP(K10,'Option Data'!$H$5:$M$170,2,FALSE)*Main!$R$1,\"\")","v":83400},{"$f":"IFERROR(VLOOKUP(K10,'Option Data'!$H$5:$M$170,3,FALSE)*Main!$R$1,\"\")","v":6600},{"$f":"IFERROR(VLOOKUP(K10,'Option Data'!$H$5:$M$170,4,FALSE),\"\")","v":3188},{"$f":"IFERROR(VLOOKUP(K10,'Option Data'!$H$5:$N$171,7,FALSE),\"\")","v":-194.55},{"$f":"IFERROR(VLOOKUP(K10,'Option Data'!$H$5:$M$170,6,FALSE),\"\")","v":418.5},{"$f":"IFERROR(VLOOKUP(K10,'Option Data'!$H$5:$M$170,5,FALSE),\"\")","v":20.399999999999999},23450,{"$f":"IFERROR(VLOOKUP(K10,'Option Data'!A7:$I$251,5,FALSE),\"\")","v":21.76},{"$f":"IFERROR(VLOOKUP(K10,'Option Data'!A7:$I$251,6,FALSE),\"\")","v":92.4},{"$f":"IFERROR(VLOOKUP(K10,'Option Data'!A7:$I$251,7,FALSE),\"\")","v":33.950000000000003},{"$f":"IFERROR(VLOOKUP(K10,'Option Data'!A7:$I$251,4,FALSE),\"\")","v":256610},{"$f":"IFERROR(VLOOKUP(K10,'Option Data'!A7:$I$251,3,FALSE)*Main!$R$1,\"\")","v":-297375},{"$f":"IFERROR(VLOOKUP(K10,'Option Data'!A7:$I$251,2,FALSE)*Main!$R$1,\"\")","v":936150},"Short Covering",16,14,13,{"$f":"IF(F10*F10>1000000,IFERROR(F10/G10,0),0)","v":2.0702634880803013},{"$f":"IF(P10*P10>1000000,IFERROR(P10/O10,0),0)","v":-1.1588597482561085},8.9088287133472194E-2,11.224820143884893]
[11,10,14,"Short Buildup",{"$f":"IFERROR(VLOOKUP(K11,'Option Data'!$H$5:$M$170,2,FALSE)*Main!$R$1,\"\")","v":1463775},{"$f":"IFERROR(VLOOKUP(K11,'Option Data'!$H$5:$M$170,3,FALSE)*Main!$R$1,\"\")","v":27000},{"$f":"IFERROR(VLOOKUP(K11,'Option Data'!$H$5:$M$170,4,FALSE),\"\")","v":73676},{"$f":"IFERROR(VLOOKUP(K11,'Option Data'!$H$5:$N$171,7,FALSE),\"\")","v":-188.9},{"$f":"IFERROR(VLOOKUP(K11,'Option Data'!$H$5:$M$170,6,FALSE),\"\")","v":382.3},{"$f":"IFERROR(VLOOKUP(K11,'Option Data'!$H$5:$M$170,5,FALSE),\"\")","v":20.18},23500,{"$f":"IFERROR(VLOOKUP(K11,'Option Data'!A8:$I$251,5,FALSE),\"\")","v":21.52},{"$f":"IFERROR(VLOOKUP(K11,'Option Data'!A8:$I$251,6,FALSE),\"\")","v":105.15},{"$f":"IFERROR(VLOOKUP(K11,'Option Data'!A8:$I$251,7,FALSE),\"\")","v":39.75},{"$f":"IFERROR(VLOOKUP(K11,'Option Data'!A8:$I$251,4,FALSE),\"\")","v":1055928},{"$f":"IFERROR(VLOOKUP(K11,'Option Data'!A8:$I$251,3,FALSE)*Main!$R$1,\"\")","v":1290300},{"$f":"IFERROR(VLOOKUP(K11,'Option Data'!A8:$I$251,2,FALSE)*Main!$R$1,\"\")","v":5718075},"Long Buildup",3,2,4,0.36646940659102012,1.2219583153396822,{"$f":"E11/Q11","v":0.25599087105363255},3.9063893016344724]
[14,15,13,"Short Buildup",{"$f":"IFERROR(VLOOKUP(K12,'Option Data'!$H$5:$M$170,2,FALSE)*Main!$R$1,\"\")","v":146325},{"$f":"IFERROR(VLOOKUP(K12,'Option Data'!$H$5:$M$170,3,FALSE)*Main!$R$1,\"\")","v":47325},{"$f":"IFERROR(VLOOKUP(K12,'Option Data'!$H$5:$M$170,4,FALSE),\"\")","v":10705},{"$f":"IFERROR(VLOOKUP(K12,'Option Data'!$H$5:$N$171,7,FALSE),\"\")","v":-182.45},{"$f":"IFERROR(VLOOKUP(K12,'Option Data'!$H$5:$M$170,6,FALSE),\"\")","v":345.2},{"$f":"IFERROR(VLOOKUP(K12,'Option Data'!$H$5:$M$170,5,FALSE),\"\")","v":20.14},23550,{"$f":"IFERROR(VLOOKUP(K12,'Option Data'!A9:$I$251,5,FALSE),\"\")","v":21.26},{"$f":"IFERROR(VLOOKUP(K12,'Option Data'!A9:$I$251,6,FALSE),\"\")","v":119.45},{"$f":"IFERROR(VLOOKUP(K12,'Option Data'!A9:$I$251,7,FALSE),\"\")","v":45.95},{"$f":"IFERROR(VLOOKUP(K12,'Option Data'!A9:$I$251,4,FALSE),\"\")","v":342580},{"$f":"IFERROR(VLOOKUP(K12,'Option Data'!A9:$I$251,3,FALSE)*Main!$R$1,\"\")","v":240000},{"$f":"IFERROR(VLOOKUP(K12,'Option Data'!A9:$I$251,2,FALSE)*Main!$R$1,\"\")","v":1050750},"Long Buildup",9,12,12,4.4208313872022416,0.70056629108529389,0.13925767309064954,7.1809328549461817]
[12,12,11,"Short Buildup",{"$f":"IFERROR(VLOOKUP(K13,'Option Data'!$H$5:$M$170,2,FALSE)*Main!$R$1,\"\")","v":1114425},{"$f":"IFERROR(VLOOKUP(K13,'Option Data'!$H$5:$M$170,3,FALSE)*Main!$R$1,\"\")","v":224025},{"$f":"IFERROR(VLOOKUP(K13,'Option Data'!$H$5:$M$170,4,FALSE),\"\")","v":67635},{"$f":"IFERROR(VLOOKUP(K13,'Option Data'!$H$5:$N$171,7,FALSE),\"\")","v":-174.4},{"$f":"IFERROR(VLOOKUP(K13,'Option Data'!$H$5:$M$170,6,FALSE),\"\")","v":313.05},{"$f":"IFERROR(VLOOKUP(K13,'Option Data'!$H$5:$M$170,5,FALSE),\"\")","v":20.14},23600,{"$f":"IFERROR(VLOOKUP(K13,'Option Data'!A10:$I$251,5,FALSE),\"\")","v":21.03},{"$f":"IFERROR(VLOOKUP(K13,'Option Data'!A10:$I$251,6,FALSE),\"\")","v":135.15},{"$f":"IFERROR(VLOOKUP(K13,'Option Data'!A10:$I$251,7,FALSE),\"\")","v":53.4},{"$f":"IFERROR(VLOOKUP(K13,'Option Data'!A10:$I$251,4,FALSE),\"\")","v":644352},{"$f":"IFERROR(VLOOKUP(K13,'Option Data'!A10:$I$251,3,FALSE)*Main!$R$1,\"\")","v":481875},{"$f":"IFERROR(VLOOKUP(K13,'Option Data'!A10:$I$251,2,FALSE)*Main!$R$1,\"\")","v":2860125},"Long Buildup",7,6,7,3.3122643601685517,0.74784434594755667,0.38964206109872818,2.5664580388989839]
[13,14,12,"Short Buildup",{"$f":"IFERROR(VLOOKUP(K14,'Option Data'!$H$5:$M$170,2,FALSE)*Main!$R$1,\"\")","v":261825},{"$f":"IFERROR(VLOOKUP(K14,'Option Data'!$H$5:$M$170,3,FALSE)*Main!$R$1,\"\")","v":129600},{"$f":"IFERROR(VLOOKUP(K14,'Option Data'!$H$5:$M$170,4,FALSE),\"\")","v":37894},{"$f":"IFERROR(VLOOKUP(K14,'Option Data'!$H$5:$N$171,7,FALSE),\"\")","v":-168.8},{"$f":"IFERROR(VLOOKUP(K14,'Option Data'!$H$5:$M$170,6,FALSE),\"\")","v":279.10000000000002},{"$f":"IFERROR(VLOOKUP(K14,'Option Data'!$H$5:$M$170,5,FALSE),\"\")","v":19.829999999999998},{"$f":"K15-$R$4","v":23650},{"$f":"IFERROR(VLOOKUP(K14,'Option Data'!A11:$I$251,5,FALSE),\"\")","v":20.84},{"$f":"IFERROR(VLOOKUP(K14,'Option Data'!A11:$I$251,6,FALSE),\"\")","v":153.25},{"$f":"IFERROR(VLOOKUP(K14,'Option Data'!A11:$I$251,7,FALSE),\"\")","v":60.3},{"$f":"IFERROR(VLOOKUP(K14,'Option Data'!A11:$I$251,4,FALSE),\"\")","v":360238},{"$f":"IFERROR(VLOOKUP(K14,'Option Data'!A11:$I$251,3,FALSE)*Main!$R$1,\"\")","v":431475},{"$f":"IFERROR(VLOOKUP(K14,'Option Data'!A11:$I$251,2,FALSE)*Main!$R$1,\"\")","v":1234425},"Long Buildup",8,11,11,3.4200665012930807,1.1977498209517041,0.21210280089920408,4.7146949298195358]
[9,9,10,"Short Buildup",{"$f":"IFERROR(VLOOKUP(K15,'Option Data'!$H$5:$M$170,2,FALSE)*Main!$R$1,\"\")","v":1632825},{"$f":"IFERROR(VLOOKUP(K15,'Option Data'!$H$5:$M$170,3,FALSE)*Main!$R$1,\"\")","v":695700},{"$f":"IFERROR(VLOOKUP(K15,'Option Data'!$H$5:$M$170,4,FALSE),\"\")","v":231073},{"$f":"IFERROR(VLOOKUP(K15,'Option Data'!$H$5:$N$171,7,FALSE),\"\")","v":-160.65},{"$f":"IFERROR(VLOOKUP(K15,'Option Data'!$H$5:$M$170,6,FALSE),\"\")","v":249.2},{"$f":"IFERROR(VLOOKUP(K15,'Option Data'!$H$5:$M$170,5,FALSE),\"\")","v":19.649999999999999},{"$f":"K16-$R$4","v":23700},{"$f":"IFERROR(VLOOKUP(K15,'Option Data'!A12:$I$251,5,FALSE),\"\")","v":20.71},{"$f":"IFERROR(VLOOKUP(K15,'Option Data'!A12:$I$251,6,FALSE),\"\")","v":172.8},{"$f":"IFERROR(VLOOKUP(K15,'Option Data'!A12:$I$251,7,FALSE),\"\")","v":69},{"$f":"IFERROR(VLOOKUP(K15,'Option Data'!A12:$I$251,4,FALSE),\"\")","v":818875},{"$f":"IFERROR(VLOOKUP(K15,'Option Data'!A12:$I$251,3,FALSE)*Main!$R$1,\"\")","v":826650},{"$f":"IFERROR(VLOOKUP(K15,'Option Data'!A12:$I$251,2,FALSE)*Main!$R$1,\"\")","v":2865450},"Long Buildup",4,5,6,3.0107368667044612,1.0094947336284537,0.56983196356593202,1.7549033117449819]
{"$rows_left_out":31}
{"sheet":"Sheet4","index":7,"n_rows":42,"n_cols":23,"rows_kept":42,"cut":false,"hidden":true,"merged":[]}
[]
[]
[]
["Calls chart for row 29",8894,900,11461,30.02,250.05,-5.55,450,249.5,250.05,250,15200,50,117.9,118.15,50,-26.75,118.15,32.840000000000003,51251,5835,44957,"Puts chart for row 29"]
["Calls chart for row 30",4824,841,7583,29.8,219.4,-4.95,50,217.4,217.8,100,15250,150,135.80000000000001,136.05000000000001,200,-27.85,135.80000000000001,32.409999999999997,18988,1493,13638,"Puts chart for row 30"]
["Calls chart for row 31",59927,8149,71441,29.26,187.8,-8.85,50,187.65,188,100,15300,100,155.19999999999999,155.5,100,-27.95,155.25,32.229999999999997,85125,9844,67687,"Puts chart for row 31"]
["Calls chart for row 32",15214,4662,34796,28.86,158.94999999999999,-11.55,100,158.94999999999999,159.25,100,15350,100,177.45,177.8,550,-26.5,177.7,31.54,29800,4037,13688,"Puts chart for row 32"]
["Calls chart for row 33",50273,6775,53336,28.51,132.69999999999999,-12.7,50,132.65,132.94999999999999,100,15400,50,202.2,202.5,200,-25.7,202.45,31.62,38100,5308,33980,"Puts chart for row 33"]
["Calls chart for row 34",10097,1013,14163,28.12,111.05,-9.9499999999999993,350,110.4,110.6,50,15450,50,230.35,230.75,150,-25.5,229.95,30.92,3618,327,4271]
[]
[]
[]
["Calls chart for row 29",10507,2513,17107,30.56,222.55,-33.049999999999997,50,221.7,222.05,50,15200,50,132.65,132.75,50,-12.05,132.85,32.33,80309,15339,54461,"Puts chart for row 29"]
["Calls chart for row 30",5678,1695,11188,30.12,191.5,-32.85,150,190.9,191.25,150,15250,150,152.05000000000001,152.4,400,-11,152.65,32.03,30469,4981,17126,"Puts chart for row 30"]
["Calls chart for row 31",67507,15729,104538,29.66,162.80000000000001,-33.85,150,162.55000000000001,162.75,50,15300,200,173.8,174.25,550,-9.5,173.7,31.36,133128,20567,78410,"Puts chart for row 31"]
{"$rows_left_out":28}
{"sheet":"Sheet1","index":8,"n_rows":38,"n_cols":10,"rows_kept":38,"cut":false,"hidden":true,"merged":[[6,3,7,3],[6,7,7,7],[29,0,30,3],[29,5,30,8],[0,0,0,1],[0,2,0,3],[0,6,1,7],[0,8,1,9],[6,0,6,2],[6,4,6,6]]}
["CALL",null,"PUT",null,null,null,"CALL",null,"PUT"]
["TOP",10,"TOP",10]
["Hurdle",{"$f":"LARGE(Main!F8:F24,B2)","v":695700},"HURDLE",{"$f":"LARGE(Main!P8:P24,D2)","v":183525},null,null,"Max Volume 1",{"$f":"LARGE(Main!$G$8:$G$24,1)","v":1671525},"Max Volume 1",{"$f":"LARGE(Main!$O$8:$O$24,1)","v":1845258}]
["Count",{"$f":"COUNTIF(Main!F8:F24, \">=\"&B3)","v":10},"COUNT",{"$f":"COUNTIF(Main!P8:P26, \">=\"&D3)","v":10},null,null,"Max Volume 2",{"$f":"LARGE(Main!$G$8:$G$24,2)","v":1526400},"Max Volume 2",{"$f":"LARGE(Main!$O$8:$O$24,2)","v":1515371}]
[]
[]
["CALL",null,null,"CE STRIKE PRICE","PUTS",null,null,"PE STRIKE PRICE"]
["No","OI CE","Ch OI CE",null,"No","OI PE","Ch OI PE"]
[{"$f":"IF(ROWS(A$9:A9)>$B$4,\"\",ROWS(A$9:A9))","v":1},{"$f":"IF(A9=\"\",\"\",LARGE(Main!$E$8:$E$24,A9))","v":10932900},{"$f":"IF(A9=\"\",\"\",LARGE(Main!$F$8:$F$24,A9))","v":5015250},{"$f":"SUMIF(Main!$F$8:$F$24,C9,Main!$K$8:$K$24)","v":23900},{"$f":"IF(ROWS(E$9:E9)>$D$4,\"\",ROWS(E$9:E9))","v":1},{"$f":"IF(E9=\"\",\"\",LARGE(Main!$Q$8:$Q$24,E9))","v":5788650},{"$f":"IF(E9=\"\",\"\",LARGE(Main!$P$8:$P$24,E9))","v":2062575},{"$f":"SUMIF(Main!$P$8:$P$24,G9,Main!$K$8:$K$24)","v":23800}]
[{"$f":"IF(ROWS(A$9:A10)>$B$4,\"\",ROWS(A$9:A10))","v":2},{"$f":"IF(A10=\"\",\"\",LARGE(Main!$E$8:$E$24,A10))","v":7179750},{"$f":"IF(A10=\"\",\"\",LARGE(Main!$F$8:$F$24,A10))","v":4836075},{"$f":"SUMIF(Main!$F$8:$F$24,C10,Main!$K$8:$K$24)","v":24000},{"$f":"IF(ROWS(E$9:E10)>$D$4,\"\",ROWS(E$9:E10))","v":2},{"$f":"IF(E10=\"\",\"\",LARGE(Main!$Q$8:$Q$24,E10))","v":5718075},{"$f":"IF(E10=\"\",\"\",LARGE(Main!$P$8:$P$24,E10))","v":1318800},{"$f":"SUMIF(Main!$P$8:$P$24,G10,Main!$K$8:$K$24)","v":23750}]
[{"$f":"IF(ROWS(A$9:A11)>$B$4,\"\",ROWS(A$9:A11))","v":3},{"$f":"IF(A11=\"\",\"\",LARGE(Main!$E$8:$E$24,A11))","v":5977425},{"$f":"IF(A11=\"\",\"\",LARGE(Main!$F$8:$F$24,A11))","v":4435650},{"$f":"SUMIF(Main!$F$8:$F$24,C11,Main!$K$8:$K$24)","v":23800},{"$f":"IF(ROWS(E$9:E11)>$D$4,\"\",ROWS(E$9:E11))","v":3},{"$f":"IF(E11=\"\",\"\",LARGE(Main!$Q$8:$Q$24,E11))","v":3929475},{"$f":"IF(E11=\"\",\"\",LARGE(Main!$P$8:$P$24,E11))","v":1290300},{"$f":"SUMIF(Main!$P$8:$P$24,G11,Main!$K$8:$K$24)","v":23500}]
[{"$f":"IF(ROWS(A$9:A12)>$B$4,\"\",ROWS(A$9:A12))","v":4},{"$f":"IF(A12=\"\",\"\",LARGE(Main!$E$8:$E$24,A12))","v":4466025},{"$f":"IF(A12=\"\",\"\",LARGE(Main!$F$8:$F$24,A12))","v":3027075},{"$f":"SUMIF(Main!$F$8:$F$24,C12,Main!$K$8:$K$24)","v":23850},{"$f":"IF(ROWS(E$9:E12)>$D$4,\"\",ROWS(E$9:E12))","v":4},{"$f":"IF(E12=\"\",\"\",LARGE(Main!$Q$8:$Q$24,E12))","v":3688575},{"$f":"IF(E12=\"\",\"\",LARGE(Main!$P$8:$P$24,E12))","v":826650},{"$f":"SUMIF(Main!$P$8:$P$24,G12,Main!$K$8:$K$24)","v":23700}]
[{"$f":"IF(ROWS(A$9:A13)>$B$4,\"\",ROWS(A$9:A13))","v":5},{"$f":"IF(A13=\"\",\"\",LARGE(Main!$E$8:$E$24,A13))","v":3621375},{"$f":"IF(A13=\"\",\"\",LARGE(Main!$F$8:$F$24,A13))","v":2426925},{"$f":"SUMIF(Main!$F$8:$F$24,C13,Main!$K$8:$K$24)","v":23950},{"$f":"IF(ROWS(E$9:E13)>$D$4,\"\",ROWS(E$9:E13))","v":5},{"$f":"IF(E13=\"\",\"\",LARGE(Main!$Q$8:$Q$24,E13))","v":2865450},{"$f":"IF(E13=\"\",\"\",LARGE(Main!$P$8:$P$24,E13))","v":724050},{"$f":"SUMIF(Main!$P$8:$P$24,G13,Main!$K$8:$K$24)","v":23850}]
[{"$f":"IF(ROWS(A$9:A14)>$B$4,\"\",ROWS(A$9:A14))","v":6},{"$f":"IF(A14=\"\",\"\",LARGE(Main!$E$8:$E$24,A14))","v":3408525},{"$f":"IF(A14=\"\",\"\",LARGE(Main!$F$8:$F$24,A14))","v":2278350},{"$f":"SUMIF(Main!$F$8:$F$24,C14,Main!$K$8:$K$24)","v":24100},{"$f":"IF(ROWS(E$9:E14)>$D$4,\"\",ROWS(E$9:E14))","v":6},{"$f":"IF(E14=\"\",\"\",LARGE(Main!$Q$8:$Q$24,E14))","v":2860125},{"$f":"IF(E14=\"\",\"\",LARGE(Main!$P$8:$P$24,E14))","v":580650},{"$f":"SUMIF(Main!$P$8:$P$24,G14,Main!$K$8:$K$24)","v":23400}]
[{"$f":"IF(ROWS(A$9:A15)>$B$4,\"\",ROWS(A$9:A15))","v":7},{"$f":"IF(A15=\"\",\"\",LARGE(Main!$E$8:$E$24,A15))","v":2141475},{"$f":"IF(A15=\"\",\"\",LARGE(Main!$F$8:$F$24,A15))","v":1363425},{"$f":"SUMIF(Main!$F$8:$F$24,C15,Main!$K$8:$K$24)","v":24150},{"$f":"IF(ROWS(E$9:E15)>$D$4,\"\",ROWS(E$9:E15))","v":7},{"$f":"IF(E15=\"\",\"\",LARGE(Main!$Q$8:$Q$24,E15))","v":2445600},{"$f":"IF(E15=\"\",\"\",LARGE(Main!$P$8:$P$24,E15))","v":481875},{"$f":"SUMIF(Main!$P$8:$P$24,G15,Main!$K$8:$K$24)","v":23600}]
{"$rows_left_out":24}
{"sheet":"Screener","index":9,"n_rows":26,"n_cols":18,"rows_kept":26,"cut":false,"hidden":false,"merged":[[22,0,22,1],[4,7,4,10],[21,0,21,17],[0,0,0,4],[0,6,0,11],[0,13,0,17],[1,1,1,3],[1,7,1,10],[4,13,4,14]]}
["TREND",null,null,null,null,null,"MOVEMENT",null,null,null,null,null,null,"RANGE"]
[null,"TOTAL OI CHANGE",null,null,null,null,null,"CHANGE in O I",null,null,null,null,null,"RANK","CE","CE STRIKE","PE","PE STRIKE"]
[null,"CE OI","PE OI","NETin OI",null,null,null,"C in CE OI","C in PE OI","NET c in OI","PCR",null,null,1,{"$f":"LARGE(Main!$E$8:$E$26,1)","v":10932900},{"$f":"Sheet1!D33","v":23900},{"$f":"LARGE(Main!$Q$8:$Q$24,1)","v":5788650},{"$f":"Sheet1!I33","v":23800}]
[null,{"$f":"Main!E27","v":46089000},{"$f":"Main!Q27","v":38407875},{"$f":"B4-C4","v":7681125},null,null,null,{"$f":"Main!F27","v":26624025},{"$f":"Main!P27","v":6561300},{"$f":"H4-I4","v":20062725},{"$f":"I4/H4%","v":24.644282748382334},null,null,2,{"$f":"LARGE(Main!$E$8:$E$26,2)","v":7179750},{"$f":"Sheet1!D34","v":24000},{"$f":"LARGE(Main!$Q$8:$Q$24,2)","v":5718075},{"$f":"Sheet1!I34","v":23750}]
[null,null,null,null,null,null,null," VI",null,null,null,null,null,"BUY CE / PE",null,{"$f":"P3-P4","v":-100},null,{"$f":"R3-R4","v":50}]
[null,null,null,null,null,null,null,"CE VI","PE VI","NET c in VI","PCR"]
[null,null,null,null,null,null,null,{"$f":"Main!J27","v":19.634705882352939},{"$f":"Main!L27","v":20.707647058823529},{"$f":"H7-I7","v":-1.0729411764705894},{"$f":"I7/H7%","v":105.46451361634561}]
[]
[]
[]
[]
[]
[]
[]
[]
{"$rows_left_out":12}
{"sheet":"Symbol List","index":10,"n_rows":149,"n_cols":7,"rows_kept":149,"cut":false,"hidden":true,"merged":[]}
[]
[null,"Scrips"]
[null,"NIFTY",null,null,null,"BANKNIFTY",25]
[null,"BANKNIFTY",null,null,null,"NIFTY",75]
[null,"ACC",null,null,null,"NIFTYIT",50]
[null,"ADANIENT",null,null,null,"ADANIENT",4000]
[null,"ADANIPORTS",null,null,null,"ASHOKLEY",8000]
[null,"ADANIPOWER",null,null,null,"ACC",400]
[null,"AMARAJABAT",null,null,null,"ADANIPORTS",2500]
[null,"AMBUJACEM",null,null,null,"ADANIPOWER",10000]
[null,"APOLLOHOSP",null,null,null,"AMARAJABAT",800]
[null,"APOLLOTYRE",null,null,null,"AMBUJACEM",2500]
[null,"ASHOKLEY",null,null,null,"APOLLOHOSP",500]
[null,"ASIANPAINT",null,null,null,"APOLLOTYRE",3000]
[null,"AUROPHARMA",null,null,null,"AXISBANK",1200]
{"$rows_left_out":135}
{"sheet":"Concept","index":11,"n_rows":5,"n_cols":5,"rows_kept":5,"cut":false,"hidden":false,"merged":[[1,4,2,5],[3,4,4,5]]}
[null,"Price","Change inOI","Interpretation"]
[null,"Increasing","Increasing","Long Builup","LONG"]
[null,"Increasing","Decreasing","Short covering"]
[null,"Decreasing","Decreasing","Long Unwinding","SHORT"]
[null,"Decreasing","Increasing","Short Buildup"]