{"text_format":"1","workbook":"xlsx","n_sheets":9,"sheets":["Market Summery","mac","ostock","Slide-in-OI-Slide","OIG","G","L","Sectors","fut"],"not_rendered":{"charts":0,"images":1,"macros":1,"external_links":1,"defined_names":1,"comments":0,"pivot_tables":0},"unopened":[],"bounds":{"document_bytes":16777216,"sheet_cells":100000,"rows_first":2000,"rows_last":500,"rows_between":2000,"halvings":0,"cell_chars":16384,"cell_head_chars":4096},"cells_cut":0,"cells_raw":0,"read":"whole","date_system":"1900"}

{"sheet":"Market Summery","index":0,"n_rows":56,"n_cols":19,"rows_kept":56,"cut":false,"hidden":false,"merged":[[1,0,2,0],[1,1,1,6],[15,9,16,9],[15,10,15,13],[28,10,28,13],[1,9,2,9],[1,10,1,12],[44,0,45,0],[15,15,16,15],[15,16,15,18],[28,16,28,18],[44,1,44,3],[44,4,44,6],[15,1,15,6],[15,0,16,0],[28,9,29,9],[28,15,29,15]]}
[]
["Rank","MOST ACTIVE OPTIONS",null,null,null,null,null,null,null,"Rank"," Most OI Base High Volume ",null,null,null,null,null,null,null,"I'm Sandip R. Pawar, a full-time trader and professional software developer."]
[null,"SYMBOL","EXPIRY","OPTION TYPE","STRIKE PRICE","LTP","% CHANGE",null,null,null,"SYMBOL","COI","Volume"]
[1,{"$f":"mac!A2","v":"NIFTY"},{"$f":"mac!B2","v":"2026-04-13"},{"$f":"mac!C2","v":"Call"},{"$f":"mac!D2","v":23900},{"$f":"mac!E2","v":0.05},{"$f":"mac!F2","v":-99.978364344439598},null,null,1,{"$f":"OIG!U2","v":"RELIANCE"},{"$f":"OIG!V2","v":17633},{"$f":"OIG!W2","v":274025},null,null,null,null,null,"For more Free Tools visit :  "]
[2,{"$f":"mac!A3","v":"NIFTY"},{"$f":"mac!B3","v":"2026-04-13"},{"$f":"mac!C3","v":"Call"},{"$f":"mac!D3","v":23850},{"$f":"mac!E3","v":0.05},{"$f":"mac!F3","v":-99.981409183863093},null,null,2,{"$f":"OIG!U3","v":"HDFCBANK"},{"$f":"OIG!V3","v":19894},{"$f":"OIG!W3","v":239919},null,null,null,null,null,"https://www.appsportal.in"]
[3,{"$f":"mac!A4","v":"NIFTY"},{"$f":"mac!B4","v":"2026-04-13"},{"$f":"mac!C4","v":"Put"},{"$f":"mac!D4","v":23800},{"$f":"mac!E4","v":0.05},{"$f":"mac!F4","v":-99.917012448132695},null,null,3,{"$f":"OIG!U4","v":"TCS"},{"$f":"OIG!V4","v":14969},{"$f":"OIG!W4","v":237901}]
[4,{"$f":"mac!A5","v":"NIFTY"},{"$f":"mac!B5","v":"2026-04-13"},{"$f":"mac!C5","v":"Put"},{"$f":"mac!D5","v":23850},{"$f":"mac!E5","v":7.3},{"$f":"mac!F5","v":-89.739985945186206},null,null,4,{"$f":"OIG!U5","v":"SBIN"},{"$f":"OIG!V5","v":534},{"$f":"OIG!W5","v":164411},null,null,null,null,null,"Let’s trade smarter and grow together! 🚀📈"]
[5,{"$f":"mac!A6","v":"NIFTY"},{"$f":"mac!B6","v":"2026-04-13"},{"$f":"mac!C6","v":"Call"},{"$f":"mac!D6","v":23800},{"$f":"mac!E6","v":42.55},{"$f":"mac!F6","v":-86.182821886669899},null,null,5,{"$f":"OIG!U6","v":"MARUTI"},{"$f":"OIG!V6","v":17052},{"$f":"OIG!W6","v":160015}]
[16,{"$f":"mac!A7","v":"NIFTY"},{"$f":"mac!B7","v":"2026-04-13"},{"$f":"mac!C7","v":"Call"},{"$f":"mac!D7","v":24000},{"$f":"mac!E7","v":0.05},{"$f":"mac!F7","v":-99.970317601662202},null,null,6,{"$f":"OIG!U7","v":"TATAPOWER"},{"$f":"OIG!V7","v":4472},{"$f":"OIG!W7","v":155646}]
[17,{"$f":"mac!A8","v":"NIFTY"},{"$f":"mac!B8","v":"2026-04-13"},{"$f":"mac!C8","v":"Call"},{"$f":"mac!D8","v":23950},{"$f":"mac!E8","v":0.05},{"$f":"mac!F8","v":-99.9747219413549},null,null,7,{"$f":"OIG!U8","v":"ICICIBANK"},{"$f":"OIG!V8","v":19502},{"$f":"OIG!W8","v":153753}]
[18,{"$f":"mac!A9","v":"NIFTY"},{"$f":"mac!B9","v":"2026-04-13"},{"$f":"mac!C9","v":"Put"},{"$f":"mac!D9","v":23700},{"$f":"mac!E9","v":0.05},{"$f":"mac!F9","v":-99.882629107981202},null,null,8,{"$f":"OIG!U9","v":"NTPC"},{"$f":"OIG!V9","v":7027},{"$f":"OIG!W9","v":116549}]
[19,{"$f":"mac!A10","v":"NIFTY"},{"$f":"mac!B10","v":"2026-04-13"},{"$f":"mac!C10","v":"Put"},{"$f":"mac!D10","v":23750},{"$f":"mac!E10","v":0.05},{"$f":"mac!F10","v":-99.901185770750899},null,null,9,{"$f":"OIG!U10","v":"LT"},{"$f":"OIG!V10","v":10354},{"$f":"OIG!W10","v":113721}]
[20,{"$f":"mac!A11","v":"NIFTY"},{"$f":"mac!B11","v":"2026-04-13"},{"$f":"mac!C11","v":"Put"},{"$f":"mac!D11","v":23600},{"$f":"mac!E11","v":0.05},{"$f":"mac!F11","v":-99.839228295819893},null,null,10,{"$f":"OIG!U11","v":"ADANIENT"},{"$f":"OIG!V11","v":4707},{"$f":"OIG!W11","v":104522}]
[]
[]
["Sr","MOST ACTIVE OPTION on OI Chg & Price Action",null,null,null,null,null,null,null,"Rank","Top Future Contracts",null,null,null,null,"Rank","Top Stock Gainer of the Day"]
[null,"Symbol","Strike","Type","Ltp","Price Chg","Chg OI %",null,null,null,"Indices","Ltp","% Chg","OI",null,null,"SYMBOL","Ltp","% Chg"]
[1,{"$f":"IF( 'Slide-in-OI-Slide'!A2 <> 0, 'Slide-in-OI-Slide'!A2, \"\")","v":"TCS"},{"$f":"IF( 'Slide-in-OI-Slide'!D2 <> 0, 'Slide-in-OI-Slide'!D2, \"\")","v":2500},{"$f":"IF( 'Slide-in-OI-Slide'!C2 <> 0, 'Slide-in-OI-Slide'!C2, \"\")","v":"Put"},{"$f":"IF( 'Slide-in-OI-Slide'!E2 <> 0, 'Slide-in-OI-Slide'!E2, \"\")","v":77.95},{"$f":"IF( 'Slide-in-OI-Slide'!F2 <> 0, 'Slide-in-OI-Slide'!F2, \"\")","v":50.05},{"$f":"IF( 'Slide-in-OI-Slide'!G2 <> 0, 'Slide-in-OI-Slide'!G2, \"\")","v":-21.75},null,null,1,{"$f":"fut!T2","v":"NIFTYNXT50"},{"$f":"fut!U2","v":67349.2},{"$f":"fut!S2","v":9.6815979014037197},{"$f":"fut!V2","v":657},null,1,{"$f":"[1]G!A2","v":"ADANIENSOL"},{"$f":"[1]G!B2","v":1154},{"$f":"[1]G!D2","v":6.98}]
[2,{"$f":"IF( 'Slide-in-OI-Slide'!A3 <> 0, 'Slide-in-OI-Slide'!A3, \"\")","v":"TCS"},{"$f":"IF( 'Slide-in-OI-Slide'!D3 <> 0, 'Slide-in-OI-Slide'!D3, \"\")","v":2520},{"$f":"IF( 'Slide-in-OI-Slide'!C3 <> 0, 'Slide-in-OI-Slide'!C3, \"\")","v":"Put"},{"$f":"IF( 'Slide-in-OI-Slide'!E3 <> 0, 'Slide-in-OI-Slide'!E3, \"\")","v":91.45},{"$f":"IF( 'Slide-in-OI-Slide'!F3 <> 0, 'Slide-in-OI-Slide'!F3, \"\")","v":47.98},{"$f":"IF( 'Slide-in-OI-Slide'!G3 <> 0, 'Slide-in-OI-Slide'!G3, \"\")","v":-40.880000000000003},null,null,2,{"$f":"fut!T3","v":"ADANIPOWER"},{"$f":"fut!U3","v":182.2},{"$f":"fut!S3","v":3.16516618538021},{"$f":"fut!V3","v":18011},null,2,{"$f":"[1]G!A3","v":"SONACOMS"},{"$f":"[1]G!B3","v":554.5},{"$f":"[1]G!D3","v":6.01}]
[3,{"$f":"IF( 'Slide-in-OI-Slide'!A4 <> 0, 'Slide-in-OI-Slide'!A4, \"\")","v":"TATAPOWER"},{"$f":"IF( 'Slide-in-OI-Slide'!D4 <> 0, 'Slide-in-OI-Slide'!D4, \"\")","v":400},{"$f":"IF( 'Slide-in-OI-Slide'!C4 <> 0, 'Slide-in-OI-Slide'!C4, \"\")","v":"Call"},{"$f":"IF( 'Slide-in-OI-Slide'!E4 <> 0, 'Slide-in-OI-Slide'!E4, \"\")","v":16.25},{"$f":"IF( 'Slide-in-OI-Slide'!F4 <> 0, 'Slide-in-OI-Slide'!F4, \"\")","v":74.73},{"$f":"IF( 'Slide-in-OI-Slide'!G4 <> 0, 'Slide-in-OI-Slide'!G4, \"\")","v":-29.55},null,null,3,{"$f":"fut!T4","v":"TATAPOWER"},{"$f":"fut!U4","v":411.25},{"$f":"fut!S4","v":2.5305410122163998},{"$f":"fut!V4","v":38756},null,3,{"$f":"[1]G!A4","v":"NAM-INDIA"},{"$f":"[1]G!B4","v":960},{"$f":"[1]G!D4","v":5.65}]
[4,{"$f":"IF( 'Slide-in-OI-Slide'!A5 <> 0, 'Slide-in-OI-Slide'!A5, \"\")","v":"PIIND"},{"$f":"IF( 'Slide-in-OI-Slide'!D5 <> 0, 'Slide-in-OI-Slide'!D5, \"\")","v":2700},{"$f":"IF( 'Slide-in-OI-Slide'!C5 <> 0, 'Slide-in-OI-Slide'!C5, \"\")","v":"Put"},{"$f":"IF( 'Slide-in-OI-Slide'!E5 <> 0, 'Slide-in-OI-Slide'!E5, \"\")","v":17.149999999999999},{"$f":"IF( 'Slide-in-OI-Slide'!F5 <> 0, 'Slide-in-OI-Slide'!F5, \"\")","v":3.94},{"$f":"IF( 'Slide-in-OI-Slide'!G5 <> 0, 'Slide-in-OI-Slide'!G5, \"\")","v":-69.13},null,null,4,{"$f":"fut!T5","v":"ADANIENT"},{"$f":"fut!U5","v":2139.8000000000002},{"$f":"fut!S5","v":2.1091811414391999},{"$f":"fut!V5","v":51771},null,4,{"$f":"[1]G!A5","v":"AMBER"},{"$f":"[1]G!B5","v":7250},{"$f":"[1]G!D5","v":5.25}]
[5,{"$f":"IF( 'Slide-in-OI-Slide'!A6 <> 0, 'Slide-in-OI-Slide'!A6, \"\")","v":""},{"$f":"IF( 'Slide-in-OI-Slide'!D6 <> 0, 'Slide-in-OI-Slide'!D6, \"\")","v":""},{"$f":"IF( 'Slide-in-OI-Slide'!C6 <> 0, 'Slide-in-OI-Slide'!C6, \"\")","v":""},{"$f":"IF( 'Slide-in-OI-Slide'!E6 <> 0, 'Slide-in-OI-Slide'!E6, \"\")","v":""},{"$f":"IF( 'Slide-in-OI-Slide'!F6 <> 0, 'Slide-in-OI-Slide'!F6, \"\")","v":""},{"$f":"IF( 'Slide-in-OI-Slide'!G6 <> 0, 'Slide-in-OI-Slide'!G6, \"\")","v":""},null,null,5,{"$f":"fut!T6","v":"NTPC"},{"$f":"fut!U6","v":387.6},{"$f":"fut!S6","v":1.81245074862096},{"$f":"fut!V6","v":53616},null,5,{"$f":"[1]G!A6","v":"SIEMENS"},{"$f":"[1]G!B6","v":3390},{"$f":"[1]G!D6","v":5.2}]
[6,{"$f":"IF( 'Slide-in-OI-Slide'!A7 <> 0, 'Slide-in-OI-Slide'!A7, \"\")","v":""},{"$f":"IF( 'Slide-in-OI-Slide'!D7 <> 0, 'Slide-in-OI-Slide'!D7, \"\")","v":""},{"$f":"IF( 'Slide-in-OI-Slide'!C7 <> 0, 'Slide-in-OI-Slide'!C7, \"\")","v":""},{"$f":"IF( 'Slide-in-OI-Slide'!E7 <> 0, 'Slide-in-OI-Slide'!E7, \"\")","v":""},{"$f":"IF( 'Slide-in-OI-Slide'!F7 <> 0, 'Slide-in-OI-Slide'!F7, \"\")","v":""},{"$f":"IF( 'Slide-in-OI-Slide'!G7 <> 0, 'Slide-in-OI-Slide'!G7, \"\")","v":""},null,null,6,{"$f":"fut!T7","v":"ICICIBANK"},{"$f":"fut!U7","v":1346.7},{"$f":"fut!S7","v":1.69145963905459},{"$f":"fut!V7","v":146862},null,6,{"$f":"[1]G!A7","v":"EXIDEIND"},{"$f":"[1]G!B7","v":326},{"$f":"[1]G!D7","v":4.74}]
[7,{"$f":"IF( 'Slide-in-OI-Slide'!A8 <> 0, 'Slide-in-OI-Slide'!A8, \"\")","v":""},{"$f":"IF( 'Slide-in-OI-Slide'!D8 <> 0, 'Slide-in-OI-Slide'!D8, \"\")","v":""},{"$f":"IF( 'Slide-in-OI-Slide'!C8 <> 0, 'Slide-in-OI-Slide'!C8, \"\")","v":""},{"$f":"IF( 'Slide-in-OI-Slide'!E8 <> 0, 'Slide-in-OI-Slide'!E8, \"\")","v":""},{"$f":"IF( 'Slide-in-OI-Slide'!F8 <> 0, 'Slide-in-OI-Slide'!F8, \"\")","v":""},{"$f":"IF( 'Slide-in-OI-Slide'!G8 <> 0, 'Slide-in-OI-Slide'!G8, \"\")","v":""},null,null,7,{"$f":"fut!T8","v":"BHEL"},{"$f":"fut!U8","v":287},{"$f":"fut!S8","v":0.65231114540225799},{"$f":"fut!V8","v":40326},null,7,{"$f":"[1]G!A8","v":"CUMMINSIND"},{"$f":"[1]G!B8","v":5139},{"$f":"[1]G!D8","v":4.72}]
[8,{"$f":"IF( 'Slide-in-OI-Slide'!A9 <> 0, 'Slide-in-OI-Slide'!A9, \"\")","v":""},{"$f":"IF( 'Slide-in-OI-Slide'!D9 <> 0, 'Slide-in-OI-Slide'!D9, \"\")","v":""},{"$f":"IF( 'Slide-in-OI-Slide'!C9 <> 0, 'Slide-in-OI-Slide'!C9, \"\")","v":""},{"$f":"IF( 'Slide-in-OI-Slide'!E9 <> 0, 'Slide-in-OI-Slide'!E9, \"\")","v":""},{"$f":"IF( 'Slide-in-OI-Slide'!F9 <> 0, 'Slide-in-OI-Slide'!F9, \"\")","v":""},{"$f":"IF( 'Slide-in-OI-Slide'!G9 <> 0, 'Slide-in-OI-Slide'!G9, \"\")","v":""},null,null,8,{"$f":"fut!T9","v":"TMPV"},{"$f":"fut!U9","v":344},{"$f":"fut!S9","v":0.29154518950437303},{"$f":"fut!V9","v":67928},null,8,{"$f":"[1]G!A9","v":"LODHA"},{"$f":"[1]G!B9","v":825.85},{"$f":"[1]G!D9","v":4.5999999999999996}]
[9,{"$f":"IF( 'Slide-in-OI-Slide'!A10 <> 0, 'Slide-in-OI-Slide'!A10, \"\")","v":""},{"$f":"IF( 'Slide-in-OI-Slide'!D10 <> 0, 'Slide-in-OI-Slide'!D10, \"\")","v":""},{"$f":"IF( 'Slide-in-OI-Slide'!C10 <> 0, 'Slide-in-OI-Slide'!C10, \"\")","v":""},{"$f":"IF( 'Slide-in-OI-Slide'!E10 <> 0, 'Slide-in-OI-Slide'!E10, \"\")","v":""},{"$f":"IF( 'Slide-in-OI-Slide'!F10 <> 0, 'Slide-in-OI-Slide'!F10, \"\")","v":""},{"$f":"IF( 'Slide-in-OI-Slide'!G10 <> 0, 'Slide-in-OI-Slide'!G10, \"\")","v":""},null,null,9,{"$f":"fut!T10","v":"AXISBANK"},{"$f":"fut!U10","v":1355},{"$f":"fut!S10","v":0.170030309750868},{"$f":"fut!V10","v":88107},null,9,{"$f":"[1]G!A10","v":"ASHOKLEY"},{"$f":"[1]G!B10","v":177.99},{"$f":"[1]G!D10","v":4.47}]
[10,{"$f":"IF( 'Slide-in-OI-Slide'!A11 <> 0, 'Slide-in-OI-Slide'!A11, \"\")","v":""},{"$f":"IF( 'Slide-in-OI-Slide'!D11 <> 0, 'Slide-in-OI-Slide'!D11, \"\")","v":""},{"$f":"IF( 'Slide-in-OI-Slide'!C11 <> 0, 'Slide-in-OI-Slide'!C11, \"\")","v":""},{"$f":"IF( 'Slide-in-OI-Slide'!E11 <> 0, 'Slide-in-OI-Slide'!E11, \"\")","v":""},{"$f":"IF( 'Slide-in-OI-Slide'!F11 <> 0, 'Slide-in-OI-Slide'!F11, \"\")","v":""},{"$f":"IF( 'Slide-in-OI-Slide'!G11 <> 0, 'Slide-in-OI-Slide'!G11, \"\")","v":""},null,null,10,{"$f":"fut!T11","v":"LT"},{"$f":"fut!U11","v":3952.2},{"$f":"fut!S11","v":-0.34041909372872298},{"$f":"fut!V11","v":78023},null,10,{"$f":"[1]G!A11","v":"MOTHERSON"},{"$f":"[1]G!B11","v":122.1},{"$f":"[1]G!D11","v":4.45}]
[11,{"$f":"IF( 'Slide-in-OI-Slide'!A12 <> 0, 'Slide-in-OI-Slide'!A12, \"\")","v":""},{"$f":"IF( 'Slide-in-OI-Slide'!D12 <> 0, 'Slide-in-OI-Slide'!D12, \"\")","v":""},{"$f":"IF( 'Slide-in-OI-Slide'!C12 <> 0, 'Slide-in-OI-Slide'!C12, \"\")","v":""},{"$f":"IF( 'Slide-in-OI-Slide'!E12 <> 0, 'Slide-in-OI-Slide'!E12, \"\")","v":""},{"$f":"IF( 'Slide-in-OI-Slide'!F12 <> 0, 'Slide-in-OI-Slide'!F12, \"\")","v":""},{"$f":"IF( 'Slide-in-OI-Slide'!G12 <> 0, 'Slide-in-OI-Slide'!G12, \"\")","v":""}]
[12,{"$f":"IF( 'Slide-in-OI-Slide'!A13 <> 0, 'Slide-in-OI-Slide'!A13, \"\")","v":""},{"$f":"IF( 'Slide-in-OI-Slide'!D13 <> 0, 'Slide-in-OI-Slide'!D13, \"\")","v":""},{"$f":"IF( 'Slide-in-OI-Slide'!C13 <> 0, 'Slide-in-OI-Slide'!C13, \"\")","v":""},{"$f":"IF( 'Slide-in-OI-Slide'!E13 <> 0, 'Slide-in-OI-Slide'!E13, \"\")","v":""},{"$f":"IF( 'Slide-in-OI-Slide'!F13 <> 0, 'Slide-in-OI-Slide'!F13, \"\")","v":""},{"$f":"IF( 'Slide-in-OI-Slide'!G13 <> 0, 'Slide-in-OI-Slide'!G13, \"\")","v":""},null,null,"Rank","Bearish Future Contracts",null,null,null,null,"Rank","Bottom Stock Loser of the day"]
[13,{"$f":"IF( 'Slide-in-OI-Slide'!A14 <> 0, 'Slide-in-OI-Slide'!A14, \"\")","v":""},{"$f":"IF( 'Slide-in-OI-Slide'!D14 <> 0, 'Slide-in-OI-Slide'!D14, \"\")","v":""},{"$f":"IF( 'Slide-in-OI-Slide'!C14 <> 0, 'Slide-in-OI-Slide'!C14, \"\")","v":""},{"$f":"IF( 'Slide-in-OI-Slide'!E14 <> 0, 'Slide-in-OI-Slide'!E14, \"\")","v":""},{"$f":"IF( 'Slide-in-OI-Slide'!F14 <> 0, 'Slide-in-OI-Slide'!F14, \"\")","v":""},{"$f":"IF( 'Slide-in-OI-Slide'!G14 <> 0, 'Slide-in-OI-Slide'!G14, \"\")","v":""},null,null,null,"Indices","Ltp","% Chg","OI",null,null,"SYMBOL","Ltp","% Chg"]
[14,{"$f":"IF( 'Slide-in-OI-Slide'!A15 <> 0, 'Slide-in-OI-Slide'!A15, \"\")","v":""},{"$f":"IF( 'Slide-in-OI-Slide'!D15 <> 0, 'Slide-in-OI-Slide'!D15, \"\")","v":""},{"$f":"IF( 'Slide-in-OI-Slide'!C15 <> 0, 'Slide-in-OI-Slide'!C15, \"\")","v":""},{"$f":"IF( 'Slide-in-OI-Slide'!E15 <> 0, 'Slide-in-OI-Slide'!E15, \"\")","v":""},{"$f":"IF( 'Slide-in-OI-Slide'!F15 <> 0, 'Slide-in-OI-Slide'!F15, \"\")","v":""},{"$f":"IF( 'Slide-in-OI-Slide'!G15 <> 0, 'Slide-in-OI-Slide'!G15, \"\")","v":""},null,null,1,{"$f":"fut!T13","v":"MARUTI"},{"$f":"fut!U13","v":13120},{"$f":"fut!S13","v":-4.4289044289044197},{"$f":"fut!V13","v":63675},null,1,{"$f":"[1]L!A2","v":"COALINDIA"},{"$f":"[1]L!B2","v":435.3},{"$f":"[1]L!D2","v":-4.1399999999999997}]
[15,{"$f":"IF( 'Slide-in-OI-Slide'!A16 <> 0, 'Slide-in-OI-Slide'!A16, \"\")","v":""},{"$f":"IF( 'Slide-in-OI-Slide'!D16 <> 0, 'Slide-in-OI-Slide'!D16, \"\")","v":""},{"$f":"IF( 'Slide-in-OI-Slide'!C16 <> 0, 'Slide-in-OI-Slide'!C16, \"\")","v":""},{"$f":"IF( 'Slide-in-OI-Slide'!E16 <> 0, 'Slide-in-OI-Slide'!E16, \"\")","v":""},{"$f":"IF( 'Slide-in-OI-Slide'!F16 <> 0, 'Slide-in-OI-Slide'!F16, \"\")","v":""},{"$f":"IF( 'Slide-in-OI-Slide'!G16 <> 0, 'Slide-in-OI-Slide'!G16, \"\")","v":""},null,null,2,{"$f":"fut!T14","v":"BAJFINANCE"},{"$f":"fut!U14","v":898.75},{"$f":"fut!S14","v":-2.8325855451646},{"$f":"fut!V14","v":93140},null,2,"HINDPETRO",238.4,-3.05]
[16,{"$f":"IF( 'Slide-in-OI-Slide'!A17 <> 0, 'Slide-in-OI-Slide'!A17, \"\")","v":""},{"$f":"IF( 'Slide-in-OI-Slide'!D17 <> 0, 'Slide-in-OI-Slide'!D17, \"\")","v":""},{"$f":"IF( 'Slide-in-OI-Slide'!C17 <> 0, 'Slide-in-OI-Slide'!C17, \"\")","v":""},{"$f":"IF( 'Slide-in-OI-Slide'!E17 <> 0, 'Slide-in-OI-Slide'!E17, \"\")","v":""},{"$f":"IF( 'Slide-in-OI-Slide'!F17 <> 0, 'Slide-in-OI-Slide'!F17, \"\")","v":""},{"$f":"IF( 'Slide-in-OI-Slide'!G17 <> 0, 'Slide-in-OI-Slide'!G17, \"\")","v":""},null,null,3,{"$f":"fut!T15","v":"INDIGO"},{"$f":"fut!U15","v":4439},{"$f":"fut!S15","v":-2.7643914833961198},{"$f":"fut!V15","v":48053},null,3,{"$f":"[1]L!A4","v":"COFORGE"},{"$f":"[1]L!B4","v":1223},{"$f":"[1]L!D4","v":-3.31}]
[17,{"$f":"IF( 'Slide-in-OI-Slide'!A18 <> 0, 'Slide-in-OI-Slide'!A18, \"\")","v":""},{"$f":"IF( 'Slide-in-OI-Slide'!D18 <> 0, 'Slide-in-OI-Slide'!D18, \"\")","v":""},{"$f":"IF( 'Slide-in-OI-Slide'!C18 <> 0, 'Slide-in-OI-Slide'!C18, \"\")","v":""},{"$f":"IF( 'Slide-in-OI-Slide'!E18 <> 0, 'Slide-in-OI-Slide'!E18, \"\")","v":""},{"$f":"IF( 'Slide-in-OI-Slide'!F18 <> 0, 'Slide-in-OI-Slide'!F18, \"\")","v":""},{"$f":"IF( 'Slide-in-OI-Slide'!G18 <> 0, 'Slide-in-OI-Slide'!G18, \"\")","v":""},null,null,4,{"$f":"fut!T16","v":"RELIANCE"},{"$f":"fut!U16","v":1318.3},{"$f":"fut!S16","v":-2.70848708487084},{"$f":"fut!V16","v":160900},null,4,{"$f":"[1]L!A5","v":"INFY"},{"$f":"[1]L!B5","v":1291.4000000000001},{"$f":"[1]L!D5","v":-3.02}]
[18,{"$f":"IF( 'Slide-in-OI-Slide'!A19 <> 0, 'Slide-in-OI-Slide'!A19, \"\")","v":""},{"$f":"IF( 'Slide-in-OI-Slide'!D19 <> 0, 'Slide-in-OI-Slide'!D19, \"\")","v":""},{"$f":"IF( 'Slide-in-OI-Slide'!C19 <> 0, 'Slide-in-OI-Slide'!C19, \"\")","v":""},{"$f":"IF( 'Slide-in-OI-Slide'!E19 <> 0, 'Slide-in-OI-Slide'!E19, \"\")","v":""},{"$f":"IF( 'Slide-in-OI-Slide'!F19 <> 0, 'Slide-in-OI-Slide'!F19, \"\")","v":""},{"$f":"IF( 'Slide-in-OI-Slide'!G19 <> 0, 'Slide-in-OI-Slide'!G19, \"\")","v":""},null,null,5,{"$f":"fut!T17","v":"TCS"},{"$f":"fut!U17","v":2458.1999999999998},{"$f":"fut!S17","v":-2.15729979302658},{"$f":"fut!V17","v":187124},null,5,{"$f":"[1]L!A6","v":"TCS"},{"$f":"[1]L!B6","v":2523},{"$f":"[1]L!D6","v":-2.5499999999999998}]
[19,{"$f":"IF( 'Slide-in-OI-Slide'!A20 <> 0, 'Slide-in-OI-Slide'!A20, \"\")","v":""},{"$f":"IF( 'Slide-in-OI-Slide'!D20 <> 0, 'Slide-in-OI-Slide'!D20, \"\")","v":""},{"$f":"IF( 'Slide-in-OI-Slide'!C20 <> 0, 'Slide-in-OI-Slide'!C20, \"\")","v":""},{"$f":"IF( 'Slide-in-OI-Slide'!E20 <> 0, 'Slide-in-OI-Slide'!E20, \"\")","v":""},{"$f":"IF( 'Slide-in-OI-Slide'!F20 <> 0, 'Slide-in-OI-Slide'!F20, \"\")","v":""},{"$f":"IF( 'Slide-in-OI-Slide'!G20 <> 0, 'Slide-in-OI-Slide'!G20, \"\")","v":""},null,null,6,{"$f":"fut!T18","v":"HDFCBANK"},{"$f":"fut!U18","v":795.7},{"$f":"fut!S18","v":-2.0556376169374602},{"$f":"fut!V18","v":569050},null,6,{"$f":"[1]L!A7","v":"MPHASIS"},{"$f":"[1]L!B7","v":2329},{"$f":"[1]L!D7","v":-2.36}]
[20,{"$f":"IF( 'Slide-in-OI-Slide'!A21 <> 0, 'Slide-in-OI-Slide'!A21, \"\")","v":""},{"$f":"IF( 'Slide-in-OI-Slide'!D21 <> 0, 'Slide-in-OI-Slide'!D21, \"\")","v":""},{"$f":"IF( 'Slide-in-OI-Slide'!C21 <> 0, 'Slide-in-OI-Slide'!C21, \"\")","v":""},{"$f":"IF( 'Slide-in-OI-Slide'!E21 <> 0, 'Slide-in-OI-Slide'!E21, \"\")","v":""},{"$f":"IF( 'Slide-in-OI-Slide'!F21 <> 0, 'Slide-in-OI-Slide'!F21, \"\")","v":""},{"$f":"IF( 'Slide-in-OI-Slide'!G21 <> 0, 'Slide-in-OI-Slide'!G21, \"\")","v":""},null,null,7,{"$f":"fut!T19","v":"M&M"},{"$f":"fut!U19","v":3215.2},{"$f":"fut!S19","v":-1.5614475537321599},{"$f":"fut!V19","v":85098},null,7,{"$f":"[1]L!A8","v":"LTM"},{"$f":"[1]L!B8","v":4495},{"$f":"[1]L!D8","v":-1.68}]
[21,{"$f":"IF( 'Slide-in-OI-Slide'!A22 <> 0, 'Slide-in-OI-Slide'!A22, \"\")","v":""},{"$f":"IF( 'Slide-in-OI-Slide'!D22 <> 0, 'Slide-in-OI-Slide'!D22, \"\")","v":""},{"$f":"IF( 'Slide-in-OI-Slide'!C22 <> 0, 'Slide-in-OI-Slide'!C22, \"\")","v":""},{"$f":"IF( 'Slide-in-OI-Slide'!E22 <> 0, 'Slide-in-OI-Slide'!E22, \"\")","v":""},{"$f":"IF( 'Slide-in-OI-Slide'!F22 <> 0, 'Slide-in-OI-Slide'!F22, \"\")","v":""},{"$f":"IF( 'Slide-in-OI-Slide'!G22 <> 0, 'Slide-in-OI-Slide'!G22, \"\")","v":""},null,null,8,{"$f":"fut!T20","v":"HINDALCO"},{"$f":"fut!U20","v":979.2},{"$f":"fut!S20","v":-1.4691084725296799},{"$f":"fut!V20","v":50997},null,8,{"$f":"[1]L!A9","v":"TECHM"},{"$f":"[1]L!B9","v":1438.9},{"$f":"[1]L!D9","v":-1.55}]
[22,{"$f":"IF( 'Slide-in-OI-Slide'!A23 <> 0, 'Slide-in-OI-Slide'!A23, \"\")","v":""},{"$f":"IF( 'Slide-in-OI-Slide'!D23 <> 0, 'Slide-in-OI-Slide'!D23, \"\")","v":""},{"$f":"IF( 'Slide-in-OI-Slide'!C23 <> 0, 'Slide-in-OI-Slide'!C23, \"\")","v":""},{"$f":"IF( 'Slide-in-OI-Slide'!E23 <> 0, 'Slide-in-OI-Slide'!E23, \"\")","v":""},{"$f":"IF( 'Slide-in-OI-Slide'!F23 <> 0, 'Slide-in-OI-Slide'!F23, \"\")","v":""},{"$f":"IF( 'Slide-in-OI-Slide'!G23 <> 0, 'Slide-in-OI-Slide'!G23, \"\")","v":""},null,null,9,{"$f":"fut!T21","v":"INFY"},{"$f":"fut!U21","v":1276},{"$f":"fut!S21","v":-1.27659574468085},{"$f":"fut!V21","v":204213},null,9,{"$f":"[1]L!A10","v":"NAUKRI"},{"$f":"[1]L!B10","v":992},{"$f":"[1]L!D10","v":-1.04}]
[23,{"$f":"IF( 'Slide-in-OI-Slide'!A24 <> 0, 'Slide-in-OI-Slide'!A24, \"\")","v":""},{"$f":"IF( 'Slide-in-OI-Slide'!D24 <> 0, 'Slide-in-OI-Slide'!D24, \"\")","v":""},{"$f":"IF( 'Slide-in-OI-Slide'!C24 <> 0, 'Slide-in-OI-Slide'!C24, \"\")","v":""},{"$f":"IF( 'Slide-in-OI-Slide'!E24 <> 0, 'Slide-in-OI-Slide'!E24, \"\")","v":""},{"$f":"IF( 'Slide-in-OI-Slide'!F24 <> 0, 'Slide-in-OI-Slide'!F24, \"\")","v":""},{"$f":"IF( 'Slide-in-OI-Slide'!G24 <> 0, 'Slide-in-OI-Slide'!G24, \"\")","v":""},null,null,10,{"$f":"fut!T22","v":"MIDCPNIFTY"},{"$f":"fut!U22","v":13289.55},{"$f":"fut!S22","v":-1.2188267313551999},{"$f":"fut!V22","v":21739},null,10,{"$f":"[1]L!A11","v":"HCLTECH"},{"$f":"[1]L!B11","v":1451},{"$f":"[1]L!D11","v":-0.95}]
[24,{"$f":"IF( 'Slide-in-OI-Slide'!A25 <> 0, 'Slide-in-OI-Slide'!A25, \"\")","v":""},{"$f":"IF( 'Slide-in-OI-Slide'!D25 <> 0, 'Slide-in-OI-Slide'!D25, \"\")","v":""},{"$f":"IF( 'Slide-in-OI-Slide'!C25 <> 0, 'Slide-in-OI-Slide'!C25, \"\")","v":""},{"$f":"IF( 'Slide-in-OI-Slide'!E25 <> 0, 'Slide-in-OI-Slide'!E25, \"\")","v":""},{"$f":"IF( 'Slide-in-OI-Slide'!F25 <> 0, 'Slide-in-OI-Slide'!F25, \"\")","v":""},{"$f":"IF( 'Slide-in-OI-Slide'!G25 <> 0, 'Slide-in-OI-Slide'!G25, \"\")","v":""}]
[25,{"$f":"IF( 'Slide-in-OI-Slide'!A26 <> 0, 'Slide-in-OI-Slide'!A26, \"\")","v":""},{"$f":"IF( 'Slide-in-OI-Slide'!D26 <> 0, 'Slide-in-OI-Slide'!D26, \"\")","v":""},{"$f":"IF( 'Slide-in-OI-Slide'!C26 <> 0, 'Slide-in-OI-Slide'!C26, \"\")","v":""},{"$f":"IF( 'Slide-in-OI-Slide'!E26 <> 0, 'Slide-in-OI-Slide'!E26, \"\")","v":""},{"$f":"IF( 'Slide-in-OI-Slide'!F26 <> 0, 'Slide-in-OI-Slide'!F26, \"\")","v":""},{"$f":"IF( 'Slide-in-OI-Slide'!G26 <> 0, 'Slide-in-OI-Slide'!G26, \"\")","v":""}]
[]
[]
["Rank","Sector Gainer",null,null,"Sector Loser"]
[null,"Indices","Ltp","% Chg","Indices","Ltp","% Chg"]
[1,{"$f":"Sectors!T2","v":"INDIA VIX"},{"$f":"Sectors!U2","v":20.5},{"$f":"Sectors!S2","v":8.75},{"$f":"Sectors!T13","v":"NIFTY MOBILITY"},{"$f":"Sectors!U13","v":21023.599999999999},{"$f":"Sectors!S13","v":-2.12}]
[2,{"$f":"Sectors!T3","v":"NIFTY50 TR 1X INV"},{"$f":"Sectors!U3","v":179.9},{"$f":"Sectors!S3","v":0.93},{"$f":"Sectors!T14","v":"NIFTY AUTO"},{"$f":"Sectors!U14","v":26084.55},{"$f":"Sectors!S14","v":-2.09}]
[3,{"$f":"Sectors!T4","v":"NIFTY50 PR 1X INV"},{"$f":"Sectors!U4","v":220.05},{"$f":"Sectors!S4","v":0.89},{"$f":"Sectors!T15","v":"NIFTY TRANS LOGIS"},{"$f":"Sectors!U15","v":23442.9},{"$f":"Sectors!S15","v":-1.99}]
[4,{"$f":"Sectors!T5","v":"NIFTY IND DEFENCE"},{"$f":"Sectors!U5","v":8334.5},{"$f":"Sectors!S5","v":0.42},{"$f":"Sectors!T16","v":"NIFTY50 TR 2X LEV"},{"$f":"Sectors!U16","v":17911.8},{"$f":"Sectors!S16","v":-1.77},null,null,null,"Fetching Method","None"]
[5,{"$f":"Sectors!T6","v":"NIFTY IPO"},{"$f":"Sectors!U6","v":2009.35},{"$f":"Sectors!S6","v":0.37},{"$f":"Sectors!T17","v":"NIFTY50 TR 2X LEV"},{"$f":"Sectors!U17","v":17911.8},{"$f":"Sectors!S17","v":-1.77}]
[6,{"$f":"Sectors!T7","v":"NIFTY CPSE"},{"$f":"Sectors!U7","v":7142.65},{"$f":"Sectors!S7","v":0.26},{"$f":"Sectors!T18","v":"NIFTY GROWSECT 15"},{"$f":"Sectors!U18","v":10881.6},{"$f":"Sectors!S18","v":-1.69},null,null,null,"Mozila"]
[7,{"$f":"Sectors!T8","v":"NIFTY ENERGY"},{"$f":"Sectors!U8","v":37195.050000000003},{"$f":"Sectors!S8","v":0.06},{"$f":"Sectors!T19","v":"NIFTY200MOMENTM30"},{"$f":"Sectors!U19","v":30007.599999999999},{"$f":"Sectors!S19","v":-1.66},null,null,null,"Chrome"]
[8,{"$f":"Sectors!T9","v":"BHARATBOND-APR31"},{"$f":"Sectors!U9","v":1427.58},{"$f":"Sectors!S9","v":0.02},{"$f":"Sectors!T20","v":"NIFTY50 USD"},{"$f":"Sectors!U20","v":8839.2000000000007},{"$f":"Sectors!S20","v":-1.64},null,null,null,"None"]
[9,{"$f":"Sectors!T10","v":"BHARATBOND-APR30"},{"$f":"Sectors!U10","v":1573.42},{"$f":"Sectors!S10","v":0.01},{"$f":"Sectors!T21","v":"NIFTY INTERNET"},{"$f":"Sectors!U21","v":1161.3},{"$f":"Sectors!S21","v":-1.61}]
[10,{"$f":"Sectors!T11","v":"BHARATBOND-APR30"},{"$f":"Sectors!U11","v":1573.42},{"$f":"Sectors!S11","v":0.01},{"$f":"Sectors!T22","v":"NIFTY MNC"},{"$f":"Sectors!U22","v":30028.55},{"$f":"Sectors!S22","v":-1.49}]

{"sheet":"mac","index":1,"n_rows":21,"n_cols":6,"rows_kept":21,"cut":false,"hidden":true,"merged":[]}
["underlying","expiryDate","optionType","strikePrice","lastPrice","pChange"]
["NIFTY","2026-04-13","Call",23900,0.05,-99.978364344439598]
["NIFTY","2026-04-13","Call",23850,0.05,-99.981409183863093]
["NIFTY","2026-04-13","Put",23800,0.05,-99.917012448132695]
["NIFTY","2026-04-13","Put",23850,7.3,-89.739985945186206]
["NIFTY","2026-04-13","Call",23800,42.55,-86.182821886669899]
["NIFTY","2026-04-13","Call",24000,0.05,-99.970317601662202]
["NIFTY","2026-04-13","Call",23950,0.05,-99.9747219413549]
["NIFTY","2026-04-13","Put",23700,0.05,-99.882629107981202]
["NIFTY","2026-04-13","Put",23750,0.05,-99.901185770750899]
["NIFTY","2026-04-13","Put",23600,0.05,-99.839228295819893]
["NIFTY","2026-04-13","Put",23900,57.1,-32.665094339622598]
["NIFTY","2026-04-13","Put",23500,0.05,-99.7821350762527]
["NIFTY","2026-04-13","Put",23650,0.05,-99.863760217983597]
["NIFTY","2026-04-13","Call",23750,92.35,-73.428283700186995]
["NIFTY","2026-04-13","Call",23700,142.35,-63.602659166453499]
["NIFTY","2026-04-13","Call",24050,0.05,-99.964788732394297]
["NIFTY","2026-04-13","Put",23550,0.05,-99.813432835820805]
["NIFTY","2026-04-13","Call",24100,0.05,-99.957464908549497]
["NIFTY","2026-04-13","Put",23400,0.05,-99.6978851963746]
["NIFTY","2026-04-13","Call",23600,242.5,-49.542238868081498]

{"sheet":"ostock","index":2,"n_rows":0,"n_cols":0,"rows_kept":0,"cut":false,"hidden":true,"merged":[]}

{"sheet":"Slide-in-OI-Slide","index":3,"n_rows":5,"n_cols":8,"rows_kept":5,"cut":false,"hidden":true,"merged":[]}
["symbol","expiryDate","optionType","strikePrice","lastPrice","pChange","pChangeInOI","Trend"]
["TCS","2026-04-28","Put",2500,77.95,50.05,-21.75,"Slide-in-OI-Slide in price"]
["TCS","2026-04-28","Put",2520,91.45,47.98,-40.880000000000003,"Slide-in-OI-Slide in price"]
["TATAPOWER","2026-04-28","Call",400,16.25,74.73,-29.55,"Slide-in-OI-Slide in price"]
["PIIND","2026-04-28","Put",2700,17.149999999999999,3.94,-69.13,"Slide-in-OI-Slide in price"]

{"sheet":"OIG","index":4,"n_rows":501,"n_cols":23,"rows_kept":501,"cut":false,"hidden":true,"merged":[]}
["symbol","latestOI","prevOI","changeInOI","avgInOI","volume",null,"Rank"]
["NIFTY",10366733,7744217,2622516,33.86,375739763,null,{"$f":"IFERROR( RANK(F2,$F$2:$F$500,0)+COUNTIF($F$2:F2,F2)-1, \"\")","v":1},{"$f":"IFERROR( IF(AND(H2<>\"\", A2<>\"NIFTY\", A2<>\"BANKNIFTY\", A2<>\"MIDCPNIFTY\", A2<>\"FINNIFTY\" ), H2, \"\"), \"\")","v":""},{"$f":"IFERROR( IF(AND(I2<>\"\", A2<>\"NIFTY\", A2<>\"BANKNIFTY\", A2<>\"MIDCPNIFTY\", A2<>\"FINNIFTY\" ), A2, \"\"), \"\")","v":""},null,null,null,null,null,null,null,null,null,{"$f":"SMALL(I:I,1)","v":3},{"$f":"VLOOKUP(T2,H:J,3,FALSE)","v":"RELIANCE"},{"$f":"VLOOKUP(U2,A:D,4,FALSE)","v":17633},{"$f":"VLOOKUP(U2,A:F,6,FALSE)","v":274025}]
["ADANIPOWER",29207,22680,6527,28.78,52419,null,{"$f":"IFERROR( RANK(F3,$F$2:$F$500,0)+COUNTIF($F$2:F3,F3)-1, \"\")","v":38},{"$f":"IFERROR( IF(AND(H3<>\"\", A3<>\"NIFTY\", A3<>\"BANKNIFTY\", A3<>\"MIDCPNIFTY\", A3<>\"FINNIFTY\" ), H3, \"\"), \"\")","v":38},{"$f":"IFERROR( IF(AND(I3<>\"\", A3<>\"NIFTY\", A3<>\"BANKNIFTY\", A3<>\"MIDCPNIFTY\", A3<>\"FINNIFTY\" ), A3, \"\"), \"\")","v":"ADANIPOWER"},null,null,null,null,null,null,null,null,null,{"$f":"SMALL(I:I,2)","v":4},{"$f":"VLOOKUP(T3,H:J,3,FALSE)","v":"HDFCBANK"},{"$f":"VLOOKUP(U3,A:D,4,FALSE)","v":19894},{"$f":"VLOOKUP(U3,A:F,6,FALSE)","v":239919}]
["FINNIFTY",7243,5797,1446,24.94,12079,null,{"$f":"IFERROR( RANK(F4,$F$2:$F$500,0)+COUNTIF($F$2:F4,F4)-1, \"\")","v":136},{"$f":"IFERROR( IF(AND(H4<>\"\", A4<>\"NIFTY\", A4<>\"BANKNIFTY\", A4<>\"MIDCPNIFTY\", A4<>\"FINNIFTY\" ), H4, \"\"), \"\")","v":""},"",null,null,null,null,null,null,null,null,null,{"$f":"SMALL(I:I,3)","v":5},"TCS",14969,237901]
["ICICIPRULI",30481,24429,6052,24.77,21132,null,{"$f":"IFERROR( RANK(F5,$F$2:$F$500,0)+COUNTIF($F$2:F5,F5)-1, \"\")","v":91},91,"ICICIPRULI",null,null,null,null,null,null,null,null,null,{"$f":"SMALL(I:I,4)","v":6},"SBIN",534,164411]
["HYUNDAI",30557,24859,5698,22.92,14865,null,{"$f":"IFERROR( RANK(F6,$F$2:$F$500,0)+COUNTIF($F$2:F6,F6)-1, \"\")","v":121},121,"HYUNDAI",null,null,null,null,null,null,null,null,null,{"$f":"SMALL(I:I,5)","v":7},"MARUTI",17052,160015]
["HEROMOTOCO",51508,42033,9475,22.54,52404,null,{"$f":"IFERROR( RANK(F7,$F$2:$F$500,0)+COUNTIF($F$2:F7,F7)-1, \"\")","v":39},39,"HEROMOTOCO",null,null,null,null,null,null,null,null,null,{"$f":"SMALL(I:I,6)","v":8},"TATAPOWER",4472,155646]
["AMBER",26659,22069,4590,20.8,35167,null,{"$f":"IFERROR( RANK(F8,$F$2:$F$500,0)+COUNTIF($F$2:F8,F8)-1, \"\")","v":57},57,"AMBER",null,null,null,null,null,null,null,null,null,{"$f":"SMALL(I:I,7)","v":9},"ICICIBANK",19502,153753]
["WAAREEENER",46185,39980,6205,15.52,92118,null,{"$f":"IFERROR( RANK(F9,$F$2:$F$500,0)+COUNTIF($F$2:F9,F9)-1, \"\")","v":15},15,"WAAREEENER",null,null,null,null,null,null,null,null,null,{"$f":"SMALL(I:I,8)","v":11},"NTPC",7027,116549]
["MARUTI",134112,117060,17052,14.57,160015,null,{"$f":"IFERROR( RANK(F10,$F$2:$F$500,0)+COUNTIF($F$2:F10,F10)-1, \"\")","v":7},7,"MARUTI",null,null,null,null,null,null,null,null,null,{"$f":"SMALL(I:I,9)","v":12},"LT",10354,113721]
["SBILIFE",39164,34581,4583,13.25,14127,null,{"$f":"IFERROR( RANK(F11,$F$2:$F$500,0)+COUNTIF($F$2:F11,F11)-1, \"\")","v":125},125,"SBILIFE",null,null,null,null,null,null,null,null,null,{"$f":"SMALL(I:I,10)","v":13},"ADANIENT",4707,104522]
["APLAPOLLO",20583,18176,2407,13.24,12066,null,{"$f":"IFERROR( RANK(F12,$F$2:$F$500,0)+COUNTIF($F$2:F12,F12)-1, \"\")","v":137},137,"APLAPOLLO"]
["FORCEMOT",6577,5850,727,12.43,5759,null,{"$f":"IFERROR( RANK(F13,$F$2:$F$500,0)+COUNTIF($F$2:F13,F13)-1, \"\")","v":192},192,"FORCEMOT"]
["BHEL",65976,58903,7073,12.01,74305,null,{"$f":"IFERROR( RANK(F14,$F$2:$F$500,0)+COUNTIF($F$2:F14,F14)-1, \"\")","v":23},23,"BHEL"]
["EICHERMOT",78833,70905,7928,11.18,83781,null,{"$f":"IFERROR( RANK(F15,$F$2:$F$500,0)+COUNTIF($F$2:F15,F15)-1, \"\")","v":19},19,"EICHERMOT"]
["GODFRYPHLP",3344,3038,306,10.07,4864,null,{"$f":"IFERROR( RANK(F16,$F$2:$F$500,0)+COUNTIF($F$2:F16,F16)-1, \"\")","v":198},198,"GODFRYPHLP"]
["POLICYBZR",31235,28385,2850,10.039999999999999,11852,null,{"$f":"IFERROR( RANK(F17,$F$2:$F$500,0)+COUNTIF($F$2:F17,F17)-1, \"\")","v":141},141,"POLICYBZR"]
["SONACOMS",18437,16790,1647,9.81,25400,null,{"$f":"IFERROR( RANK(F18,$F$2:$F$500,0)+COUNTIF($F$2:F18,F18)-1, \"\")","v":75},75,"SONACOMS"]
["SUZLON",60511,55519,4992,8.99,56323,null,{"$f":"IFERROR( RANK(F19,$F$2:$F$500,0)+COUNTIF($F$2:F19,F19)-1, \"\")","v":36},36,"SUZLON"]
["ICICIBANK",238383,218881,19502,8.91,153753,null,{"$f":"IFERROR( RANK(F20,$F$2:$F$500,0)+COUNTIF($F$2:F20,F20)-1, \"\")","v":9},9,"ICICIBANK"]
["FORTIS",21140,19417,1723,8.8699999999999992,10378,null,{"$f":"IFERROR( RANK(F21,$F$2:$F$500,0)+COUNTIF($F$2:F21,F21)-1, \"\")","v":160},160,"FORTIS"]
["LTM",42280,38983,3297,8.4600000000000009,12154,null,{"$f":"IFERROR( RANK(F22,$F$2:$F$500,0)+COUNTIF($F$2:F22,F22)-1, \"\")","v":134},134,"LTM"]
["UNIONBANK",36865,34102,2763,8.1,24901,null,{"$f":"IFERROR( RANK(F23,$F$2:$F$500,0)+COUNTIF($F$2:F23,F23)-1, \"\")","v":77},77,"UNIONBANK"]
["MOTILALOFS",4359,4035,324,8.0299999999999994,2924,null,{"$f":"IFERROR( RANK(F24,$F$2:$F$500,0)+COUNTIF($F$2:F24,F24)-1, \"\")","v":211},211,"MOTILALOFS"]
["CHOLAFIN",44960,41659,3301,7.92,20855,null,{"$f":"IFERROR( RANK(F25,$F$2:$F$500,0)+COUNTIF($F$2:F25,F25)-1, \"\")","v":93},93,"CHOLAFIN"]
["MCX",43581,40454,3127,7.73,66535,null,{"$f":"IFERROR( RANK(F26,$F$2:$F$500,0)+COUNTIF($F$2:F26,F26)-1, \"\")","v":27},27,"MCX"]
["NTPC",104299,97272,7027,7.22,116549,null,{"$f":"IFERROR( RANK(F27,$F$2:$F$500,0)+COUNTIF($F$2:F27,F27)-1, \"\")","v":11},11,"NTPC"]
["COALINDIA",98402,91794,6608,7.2,77604,null,{"$f":"IFERROR( RANK(F28,$F$2:$F$500,0)+COUNTIF($F$2:F28,F28)-1, \"\")","v":21},21,"COALINDIA"]
["BLUESTARCO",16010,14954,1056,7.06,28967,null,{"$f":"IFERROR( RANK(F29,$F$2:$F$500,0)+COUNTIF($F$2:F29,F29)-1, \"\")","v":67},67,"BLUESTARCO"]
["TORNTPOWER",12176,11374,802,7.05,9469,null,{"$f":"IFERROR( RANK(F30,$F$2:$F$500,0)+COUNTIF($F$2:F30,F30)-1, \"\")","v":170},170,"TORNTPOWER"]
["ASTRAL",32758,30651,2107,6.87,22243,null,{"$f":"IFERROR( RANK(F31,$F$2:$F$500,0)+COUNTIF($F$2:F31,F31)-1, \"\")","v":88},88,"ASTRAL"]
["POWERGRID",68817,64483,4334,6.72,37617,null,{"$f":"IFERROR( RANK(F32,$F$2:$F$500,0)+COUNTIF($F$2:F32,F32)-1, \"\")","v":52},52,"POWERGRID"]
["UNITDSPR",50302,47351,2951,6.23,12665,null,{"$f":"IFERROR( RANK(F33,$F$2:$F$500,0)+COUNTIF($F$2:F33,F33)-1, \"\")","v":130},130,"UNITDSPR"]
["PIDILITIND",20856,19637,1219,6.21,5876,null,{"$f":"IFERROR( RANK(F34,$F$2:$F$500,0)+COUNTIF($F$2:F34,F34)-1, \"\")","v":190},190,"PIDILITIND"]
["LT",180599,170245,10354,6.08,113721,null,{"$f":"IFERROR( RANK(F35,$F$2:$F$500,0)+COUNTIF($F$2:F35,F35)-1, \"\")","v":12},12,"LT"]
["MOTHERSON",35219,33224,1995,6,17509,null,{"$f":"IFERROR( RANK(F36,$F$2:$F$500,0)+COUNTIF($F$2:F36,F36)-1, \"\")","v":104},104,"MOTHERSON"]
["TATAPOWER",80775,76303,4472,5.86,155646,null,{"$f":"IFERROR( RANK(F37,$F$2:$F$500,0)+COUNTIF($F$2:F37,F37)-1, \"\")","v":8},8,"TATAPOWER"]
["HDFCAMC",28078,26553,1525,5.74,10937,null,{"$f":"IFERROR( RANK(F38,$F$2:$F$500,0)+COUNTIF($F$2:F38,F38)-1, \"\")","v":149},149,"HDFCAMC"]
["BAJAJ-AUTO",71076,67225,3851,5.73,69723,null,{"$f":"IFERROR( RANK(F39,$F$2:$F$500,0)+COUNTIF($F$2:F39,F39)-1, \"\")","v":24},24,"BAJAJ-AUTO"]
["TORNTPHARM",17584,16634,950,5.71,10486,null,{"$f":"IFERROR( RANK(F40,$F$2:$F$500,0)+COUNTIF($F$2:F40,F40)-1, \"\")","v":158},158,"TORNTPHARM"]
["ADANIGREEN",56570,53565,3005,5.61,43133,null,{"$f":"IFERROR( RANK(F41,$F$2:$F$500,0)+COUNTIF($F$2:F41,F41)-1, \"\")","v":45},45,"ADANIGREEN"]
["JSWENERGY",40773,38610,2163,5.6,53111,null,{"$f":"IFERROR( RANK(F42,$F$2:$F$500,0)+COUNTIF($F$2:F42,F42)-1, \"\")","v":37},37,"JSWENERGY"]
["INFY",325871,308899,16972,5.49,103091,null,{"$f":"IFERROR( RANK(F43,$F$2:$F$500,0)+COUNTIF($F$2:F43,F43)-1, \"\")","v":14},14,"INFY"]
["INOXWIND",40606,38550,2056,5.33,24318,null,{"$f":"IFERROR( RANK(F44,$F$2:$F$500,0)+COUNTIF($F$2:F44,F44)-1, \"\")","v":80},80,"INOXWIND"]
["IREDA",26110,24791,1319,5.32,10899,null,{"$f":"IFERROR( RANK(F45,$F$2:$F$500,0)+COUNTIF($F$2:F45,F45)-1, \"\")","v":150},150,"IREDA"]
["WIPRO",127558,121149,6409,5.29,43568,null,{"$f":"IFERROR( RANK(F46,$F$2:$F$500,0)+COUNTIF($F$2:F46,F46)-1, \"\")","v":44},44,"WIPRO"]
["SOLARINDS",25048,23797,1251,5.26,37478,null,{"$f":"IFERROR( RANK(F47,$F$2:$F$500,0)+COUNTIF($F$2:F47,F47)-1, \"\")","v":53},53,"SOLARINDS"]
["KOTAKBANK",140044,133114,6930,5.21,38770,null,{"$f":"IFERROR( RANK(F48,$F$2:$F$500,0)+COUNTIF($F$2:F48,F48)-1, \"\")","v":51},51,"KOTAKBANK"]
["ADANIENT",96566,91859,4707,5.12,104522,null,{"$f":"IFERROR( RANK(F49,$F$2:$F$500,0)+COUNTIF($F$2:F49,F49)-1, \"\")","v":13},13,"ADANIENT"]
["LICI",25448,24251,1197,4.9400000000000004,11888,null,{"$f":"IFERROR( RANK(F50,$F$2:$F$500,0)+COUNTIF($F$2:F50,F50)-1, \"\")","v":140},140,"LICI"]
["INDIGO",114243,108880,5363,4.93,92098,null,{"$f":"IFERROR( RANK(F51,$F$2:$F$500,0)+COUNTIF($F$2:F51,F51)-1, \"\")","v":16},16,"INDIGO"]
["ABB",32309,30796,1513,4.91,29870,null,{"$f":"IFERROR( RANK(F52,$F$2:$F$500,0)+COUNTIF($F$2:F52,F52)-1, \"\")","v":66},66,"ABB"]
["POWERINDIA",16626,15859,767,4.84,22455,null,{"$f":"IFERROR( RANK(F53,$F$2:$F$500,0)+COUNTIF($F$2:F53,F53)-1, \"\")","v":87},87,"POWERINDIA"]
["FEDERALBNK",27281,26040,1241,4.7699999999999996,22713,null,{"$f":"IFERROR( RANK(F54,$F$2:$F$500,0)+COUNTIF($F$2:F54,F54)-1, \"\")","v":84},84,"FEDERALBNK"]
["AXISBANK",157551,150462,7089,4.71,62298,null,{"$f":"IFERROR( RANK(F55,$F$2:$F$500,0)+COUNTIF($F$2:F55,F55)-1, \"\")","v":31},31,"AXISBANK"]
["BSE",59379,56730,2649,4.67,83667,null,{"$f":"IFERROR( RANK(F56,$F$2:$F$500,0)+COUNTIF($F$2:F56,F56)-1, \"\")","v":20},20,"BSE"]
["BPCL",46270,44261,2009,4.54,26052,null,{"$f":"IFERROR( RANK(F57,$F$2:$F$500,0)+COUNTIF($F$2:F57,F57)-1, \"\")","v":72},72,"BPCL"]
["BANKNIFTY",1164532,1114422,50110,4.5,2427112,null,{"$f":"IFERROR( RANK(F58,$F$2:$F$500,0)+COUNTIF($F$2:F58,F58)-1, \"\")","v":2},"",""]
["INDIANB",15295,14640,655,4.47,10744,null,{"$f":"IFERROR( RANK(F59,$F$2:$F$500,0)+COUNTIF($F$2:F59,F59)-1, \"\")","v":153},153,"INDIANB"]
["OIL",25236,24173,1063,4.4000000000000004,25948,null,{"$f":"IFERROR( RANK(F60,$F$2:$F$500,0)+COUNTIF($F$2:F60,F60)-1, \"\")","v":73},73,"OIL"]
["NHPC",23901,22913,988,4.3099999999999996,11449,null,{"$f":"IFERROR( RANK(F61,$F$2:$F$500,0)+COUNTIF($F$2:F61,F61)-1, \"\")","v":147},147,"NHPC"]
["RELIANCE",429450,411817,17633,4.28,274025,null,{"$f":"IFERROR( RANK(F62,$F$2:$F$500,0)+COUNTIF($F$2:F62,F62)-1, \"\")","v":3},3,"RELIANCE"]
["OBEROIRLTY",34142,32779,1363,4.16,9600,null,{"$f":"IFERROR( RANK(F63,$F$2:$F$500,0)+COUNTIF($F$2:F63,F63)-1, \"\")","v":168},168,"OBEROIRLTY"]
["JINDALSTEL",30486,29289,1197,4.09,13428,null,{"$f":"IFERROR( RANK(F64,$F$2:$F$500,0)+COUNTIF($F$2:F64,F64)-1, \"\")","v":128},128,"JINDALSTEL"]
["HDFCLIFE",59470,57161,2309,4.04,45262,null,{"$f":"IFERROR( RANK(F65,$F$2:$F$500,0)+COUNTIF($F$2:F65,F65)-1, \"\")","v":42},42,"HDFCLIFE"]
["ASIANPAINT",96716,92988,3728,4.01,65239,null,{"$f":"IFERROR( RANK(F66,$F$2:$F$500,0)+COUNTIF($F$2:F66,F66)-1, \"\")","v":29},29,"ASIANPAINT"]
["NUVAMA",6893,6628,265,4,3789,null,{"$f":"IFERROR( RANK(F67,$F$2:$F$500,0)+COUNTIF($F$2:F67,F67)-1, \"\")","v":204},204,{"$f":"IFERROR( IF(AND(I67<>\"\", A67<>\"NIFTY\", A67<>\"BANKNIFTY\", A67<>\"MIDCPNIFTY\", A67<>\"FINNIFTY\" ), A67, \"\"), \"\")","v":"NUVAMA"}]
["ADANIENSOL",40659,39109,1550,3.96,37031,null,{"$f":"IFERROR( RANK(F68,$F$2:$F$500,0)+COUNTIF($F$2:F68,F68)-1, \"\")","v":55},{"$f":"IFERROR( IF(AND(H68<>\"\", A68<>\"NIFTY\", A68<>\"BANKNIFTY\", A68<>\"MIDCPNIFTY\", A68<>\"FINNIFTY\" ), H68, \"\"), \"\")","v":55},"ADANIENSOL"]
["TCS",403156,388187,14969,3.86,237901,null,{"$f":"IFERROR( RANK(F69,$F$2:$F$500,0)+COUNTIF($F$2:F69,F69)-1, \"\")","v":5},5,"TCS"]
["EXIDEIND",31498,30348,1150,3.79,16279,null,{"$f":"IFERROR( RANK(F70,$F$2:$F$500,0)+COUNTIF($F$2:F70,F70)-1, \"\")","v":113},113,"EXIDEIND"]
["SWIGGY",50693,48860,1833,3.75,16580,null,{"$f":"IFERROR( RANK(F71,$F$2:$F$500,0)+COUNTIF($F$2:F71,F71)-1, \"\")","v":109},109,"SWIGGY"]
["BAJFINANCE",145376,140129,5247,3.74,47997,null,{"$f":"IFERROR( RANK(F72,$F$2:$F$500,0)+COUNTIF($F$2:F72,F72)-1, \"\")","v":40},40,"BAJFINANCE"]
["HINDPETRO",39172,37764,1408,3.73,22479,null,{"$f":"IFERROR( RANK(F73,$F$2:$F$500,0)+COUNTIF($F$2:F73,F73)-1, \"\")","v":86},86,"HINDPETRO"]
["PRESTIGE",22708,21893,815,3.72,7837,null,{"$f":"IFERROR( RANK(F74,$F$2:$F$500,0)+COUNTIF($F$2:F74,F74)-1, \"\")","v":175},175,"PRESTIGE"]
["BAJAJHLDNG",7717,7441,276,3.71,1632,null,{"$f":"IFERROR( RANK(F75,$F$2:$F$500,0)+COUNTIF($F$2:F75,F75)-1, \"\")","v":215},215,"BAJAJHLDNG"]
["INDUSTOWER",53539,51651,1888,3.66,14163,null,{"$f":"IFERROR( RANK(F76,$F$2:$F$500,0)+COUNTIF($F$2:F76,F76)-1, \"\")","v":124},124,"INDUSTOWER"]
["PGEL",35324,34080,1244,3.65,26065,null,{"$f":"IFERROR( RANK(F77,$F$2:$F$500,0)+COUNTIF($F$2:F77,F77)-1, \"\")","v":71},71,"PGEL"]
["KEI",18524,17876,648,3.62,8146,null,{"$f":"IFERROR( RANK(F78,$F$2:$F$500,0)+COUNTIF($F$2:F78,F78)-1, \"\")","v":174},174,"KEI"]
["DABUR",38158,36837,1321,3.59,12055,null,{"$f":"IFERROR( RANK(F79,$F$2:$F$500,0)+COUNTIF($F$2:F79,F79)-1, \"\")","v":138},138,"DABUR"]
["DLF",93043,89841,3202,3.56,27595,null,{"$f":"IFERROR( RANK(F80,$F$2:$F$500,0)+COUNTIF($F$2:F80,F80)-1, \"\")","v":70},70,"DLF"]
["360ONE",14071,13600,471,3.46,3718,null,{"$f":"IFERROR( RANK(F81,$F$2:$F$500,0)+COUNTIF($F$2:F81,F81)-1, \"\")","v":205},205,"360ONE"]
["BANKINDIA",19377,18733,644,3.44,9887,null,{"$f":"IFERROR( RANK(F82,$F$2:$F$500,0)+COUNTIF($F$2:F82,F82)-1, \"\")","v":166},166,"BANKINDIA"]
["CIPLA",62066,60053,2013,3.35,16331,null,{"$f":"IFERROR( RANK(F83,$F$2:$F$500,0)+COUNTIF($F$2:F83,F83)-1, \"\")","v":112},112,"CIPLA"]
["NESTLEIND",46186,44712,1474,3.3,12141,null,{"$f":"IFERROR( RANK(F84,$F$2:$F$500,0)+COUNTIF($F$2:F84,F84)-1, \"\")","v":135},135,"NESTLEIND"]
["NATIONALUM",32336,31314,1022,3.26,31592,null,{"$f":"IFERROR( RANK(F85,$F$2:$F$500,0)+COUNTIF($F$2:F85,F85)-1, \"\")","v":62},62,"NATIONALUM"]
["IOC",44977,43566,1411,3.24,21232,null,{"$f":"IFERROR( RANK(F86,$F$2:$F$500,0)+COUNTIF($F$2:F86,F86)-1, \"\")","v":90},90,"IOC"]
["NAM-INDIA",5000,4846,154,3.18,5959,null,{"$f":"IFERROR( RANK(F87,$F$2:$F$500,0)+COUNTIF($F$2:F87,F87)-1, \"\")","v":188},188,"NAM-INDIA"]
["KPITTECH",28998,28111,887,3.16,10629,null,{"$f":"IFERROR( RANK(F88,$F$2:$F$500,0)+COUNTIF($F$2:F88,F88)-1, \"\")","v":155},155,"KPITTECH"]
["NMDC",67361,65306,2055,3.15,23341,null,{"$f":"IFERROR( RANK(F89,$F$2:$F$500,0)+COUNTIF($F$2:F89,F89)-1, \"\")","v":82},82,"NMDC"]
["INDHOTEL",33483,32473,1010,3.11,10211,null,{"$f":"IFERROR( RANK(F90,$F$2:$F$500,0)+COUNTIF($F$2:F90,F90)-1, \"\")","v":161},161,"INDHOTEL"]
["BIOCON",29942,29039,903,3.11,12048,null,{"$f":"IFERROR( RANK(F91,$F$2:$F$500,0)+COUNTIF($F$2:F91,F91)-1, \"\")","v":139},139,"BIOCON"]
["SBICARD",46181,44796,1385,3.09,13382,null,{"$f":"IFERROR( RANK(F92,$F$2:$F$500,0)+COUNTIF($F$2:F92,F92)-1, \"\")","v":129},129,"SBICARD"]
["ONGC",96386,93520,2866,3.06,75360,null,{"$f":"IFERROR( RANK(F93,$F$2:$F$500,0)+COUNTIF($F$2:F93,F93)-1, \"\")","v":22},22,"ONGC"]
["CGPOWER",29328,28461,867,3.05,10542,null,{"$f":"IFERROR( RANK(F94,$F$2:$F$500,0)+COUNTIF($F$2:F94,F94)-1, \"\")","v":156},156,"CGPOWER"]
["COCHINSHIP",7364,7150,214,2.99,5324,null,{"$f":"IFERROR( RANK(F95,$F$2:$F$500,0)+COUNTIF($F$2:F95,F95)-1, \"\")","v":196},196,"COCHINSHIP"]
["RVNL",54317,52746,1571,2.98,14883,null,{"$f":"IFERROR( RANK(F96,$F$2:$F$500,0)+COUNTIF($F$2:F96,F96)-1, \"\")","v":120},120,"RVNL"]
["HAVELLS",24571,23863,708,2.97,7358,null,{"$f":"IFERROR( RANK(F97,$F$2:$F$500,0)+COUNTIF($F$2:F97,F97)-1, \"\")","v":178},178,"HAVELLS"]
["HCLTECH",138620,134637,3983,2.96,31189,null,{"$f":"IFERROR( RANK(F98,$F$2:$F$500,0)+COUNTIF($F$2:F98,F98)-1, \"\")","v":63},63,"HCLTECH"]
["VBL",59374,57680,1694,2.94,19961,null,{"$f":"IFERROR( RANK(F99,$F$2:$F$500,0)+COUNTIF($F$2:F99,F99)-1, \"\")","v":97},97,"VBL"]
["ULTRACEMCO",67265,65363,1902,2.91,18207,null,{"$f":"IFERROR( RANK(F100,$F$2:$F$500,0)+COUNTIF($F$2:F100,F100)-1, \"\")","v":103},103,"ULTRACEMCO"]
["GODREJCP",30559,29737,822,2.76,5865,null,{"$f":"IFERROR( RANK(F101,$F$2:$F$500,0)+COUNTIF($F$2:F101,F101)-1, \"\")","v":191},191,"GODREJCP"]
["ICICIGI",21812,21228,584,2.75,5993,null,{"$f":"IFERROR( RANK(F102,$F$2:$F$500,0)+COUNTIF($F$2:F102,F102)-1, \"\")","v":187},187,"ICICIGI"]
["PERSISTENT",75599,73588,2011,2.73,20260,null,{"$f":"IFERROR( RANK(F103,$F$2:$F$500,0)+COUNTIF($F$2:F103,F103)-1, \"\")","v":95},95,"PERSISTENT"]
["TRENT",127785,124424,3361,2.7,31013,null,{"$f":"IFERROR( RANK(F104,$F$2:$F$500,0)+COUNTIF($F$2:F104,F104)-1, \"\")","v":65},65,"TRENT"]
["SHRIRAMFIN",80290,78231,2059,2.63,35421,null,{"$f":"IFERROR( RANK(F105,$F$2:$F$500,0)+COUNTIF($F$2:F105,F105)-1, \"\")","v":56},56,"SHRIRAMFIN"]
["AUROPHARMA",51296,49981,1315,2.63,11688,null,{"$f":"IFERROR( RANK(F106,$F$2:$F$500,0)+COUNTIF($F$2:F106,F106)-1, \"\")","v":143},143,"AUROPHARMA"]
["GMRAIRPORT",28591,27880,711,2.5499999999999998,7349,null,{"$f":"IFERROR( RANK(F107,$F$2:$F$500,0)+COUNTIF($F$2:F107,F107)-1, \"\")","v":179},179,"GMRAIRPORT"]
["JIOFIN",98393,95975,2418,2.52,22526,null,{"$f":"IFERROR( RANK(F108,$F$2:$F$500,0)+COUNTIF($F$2:F108,F108)-1, \"\")","v":85},85,"JIOFIN"]
["MUTHOOTFIN",25085,24474,611,2.5,16568,null,{"$f":"IFERROR( RANK(F109,$F$2:$F$500,0)+COUNTIF($F$2:F109,F109)-1, \"\")","v":110},110,"MUTHOOTFIN"]
["LUPIN",24497,23901,596,2.4900000000000002,12271,null,{"$f":"IFERROR( RANK(F110,$F$2:$F$500,0)+COUNTIF($F$2:F110,F110)-1, \"\")","v":133},133,"LUPIN"]
["ETERNAL",128582,125474,3108,2.48,41418,null,{"$f":"IFERROR( RANK(F111,$F$2:$F$500,0)+COUNTIF($F$2:F111,F111)-1, \"\")","v":47},47,"ETERNAL"]
["ANGELONE",20344,19857,487,2.4500000000000002,14558,null,{"$f":"IFERROR( RANK(F112,$F$2:$F$500,0)+COUNTIF($F$2:F112,F112)-1, \"\")","v":122},122,"ANGELONE"]
["HDFCBANK",832419,812525,19894,2.4500000000000002,239919,null,{"$f":"IFERROR( RANK(F113,$F$2:$F$500,0)+COUNTIF($F$2:F113,F113)-1, \"\")","v":4},4,"HDFCBANK"]
["TECHM",47057,45955,1102,2.4,12592,null,{"$f":"IFERROR( RANK(F114,$F$2:$F$500,0)+COUNTIF($F$2:F114,F114)-1, \"\")","v":131},131,"TECHM"]
["CANBK",49222,48074,1148,2.39,21586,null,{"$f":"IFERROR( RANK(F115,$F$2:$F$500,0)+COUNTIF($F$2:F115,F115)-1, \"\")","v":89},89,"CANBK"]
["PREMIERENE",25363,24790,573,2.31,15354,null,{"$f":"IFERROR( RANK(F116,$F$2:$F$500,0)+COUNTIF($F$2:F116,F116)-1, \"\")","v":118},118,"PREMIERENE"]
["ZYDUSLIFE",15419,15071,348,2.31,9896,null,{"$f":"IFERROR( RANK(F117,$F$2:$F$500,0)+COUNTIF($F$2:F117,F117)-1, \"\")","v":165},165,"ZYDUSLIFE"]
["HINDALCO",88664,86682,1982,2.29,57015,null,{"$f":"IFERROR( RANK(F118,$F$2:$F$500,0)+COUNTIF($F$2:F118,F118)-1, \"\")","v":33},33,"HINDALCO"]
["BEL",121057,118353,2704,2.2799999999999998,56833,null,{"$f":"IFERROR( RANK(F119,$F$2:$F$500,0)+COUNTIF($F$2:F119,F119)-1, \"\")","v":34},34,"BEL"]
["MANAPPURAM",25795,25219,576,2.2799999999999998,5494,null,{"$f":"IFERROR( RANK(F120,$F$2:$F$500,0)+COUNTIF($F$2:F120,F120)-1, \"\")","v":195},195,"MANAPPURAM"]
["GAIL",44672,43680,992,2.27,10126,null,{"$f":"IFERROR( RANK(F121,$F$2:$F$500,0)+COUNTIF($F$2:F121,F121)-1, \"\")","v":162},162,"GAIL"]
["PFC",72349,70744,1605,2.27,34336,null,{"$f":"IFERROR( RANK(F122,$F$2:$F$500,0)+COUNTIF($F$2:F122,F122)-1, \"\")","v":58},58,"PFC"]
["DALBHARAT",13731,13427,304,2.2599999999999998,7473,null,{"$f":"IFERROR( RANK(F123,$F$2:$F$500,0)+COUNTIF($F$2:F123,F123)-1, \"\")","v":177},177,"DALBHARAT"]
["VMM",6239,6102,137,2.25,1971,null,{"$f":"IFERROR( RANK(F124,$F$2:$F$500,0)+COUNTIF($F$2:F124,F124)-1, \"\")","v":213},213,"VMM"]
["MIDCPNIFTY",102330,100085,2245,2.2400000000000002,139488,null,{"$f":"IFERROR( RANK(F125,$F$2:$F$500,0)+COUNTIF($F$2:F125,F125)-1, \"\")","v":10},"",""]
["UNOMINDA",12740,12465,275,2.21,3377,null,{"$f":"IFERROR( RANK(F126,$F$2:$F$500,0)+COUNTIF($F$2:F126,F126)-1, \"\")","v":206},206,"UNOMINDA"]
["HUDCO",16519,16164,355,2.2000000000000002,11677,null,{"$f":"IFERROR( RANK(F127,$F$2:$F$500,0)+COUNTIF($F$2:F127,F127)-1, \"\")","v":144},144,"HUDCO"]
["ITC",191438,187335,4103,2.19,69697,null,{"$f":"IFERROR( RANK(F128,$F$2:$F$500,0)+COUNTIF($F$2:F128,F128)-1, \"\")","v":25},25,"ITC"]
["MANKIND",16155,15824,331,2.09,4479,null,{"$f":"IFERROR( RANK(F129,$F$2:$F$500,0)+COUNTIF($F$2:F129,F129)-1, \"\")","v":200},200,"MANKIND"]
["JUBLFOOD",53954,52864,1090,2.06,16006,null,{"$f":"IFERROR( RANK(F130,$F$2:$F$500,0)+COUNTIF($F$2:F130,F130)-1, \"\")","v":114},114,"JUBLFOOD"]
["ALKEM",11892,11652,240,2.06,2988,null,{"$f":"IFERROR( RANK(F131,$F$2:$F$500,0)+COUNTIF($F$2:F131,F131)-1, \"\")","v":208},208,{"$f":"IFERROR( IF(AND(I131<>\"\", A131<>\"NIFTY\", A131<>\"BANKNIFTY\", A131<>\"MIDCPNIFTY\", A131<>\"FINNIFTY\" ), A131, \"\"), \"\")","v":"ALKEM"}]
["DIXON",128111,125564,2547,2.0299999999999998,65984,null,{"$f":"IFERROR( RANK(F132,$F$2:$F$500,0)+COUNTIF($F$2:F132,F132)-1, \"\")","v":28},{"$f":"IFERROR( IF(AND(H132<>\"\", A132<>\"NIFTY\", A132<>\"BANKNIFTY\", A132<>\"MIDCPNIFTY\", A132<>\"FINNIFTY\" ), H132, \"\"), \"\")","v":28},"DIXON"]
["HINDUNILVR",88514,86817,1697,1.95,38886,null,{"$f":"IFERROR( RANK(F133,$F$2:$F$500,0)+COUNTIF($F$2:F133,F133)-1, \"\")","v":50},50,"HINDUNILVR"]
["LTF",39827,39081,746,1.91,14119,null,{"$f":"IFERROR( RANK(F134,$F$2:$F$500,0)+COUNTIF($F$2:F134,F134)-1, \"\")","v":126},126,"LTF"]
["TATACONSUM",31803,31218,585,1.87,5882,null,{"$f":"IFERROR( RANK(F135,$F$2:$F$500,0)+COUNTIF($F$2:F135,F135)-1, \"\")","v":189},189,"TATACONSUM"]
["TMPV",137496,134988,2508,1.86,89049,null,{"$f":"IFERROR( RANK(F136,$F$2:$F$500,0)+COUNTIF($F$2:F136,F136)-1, \"\")","v":17},17,"TMPV"]
["ASHOKLEY",57886,56867,1019,1.79,41613,null,{"$f":"IFERROR( RANK(F137,$F$2:$F$500,0)+COUNTIF($F$2:F137,F137)-1, \"\")","v":46},46,"ASHOKLEY"]
["IEX",36789,36159,630,1.74,11596,null,{"$f":"IFERROR( RANK(F138,$F$2:$F$500,0)+COUNTIF($F$2:F138,F138)-1, \"\")","v":146},146,"IEX"]
["PETRONET",32044,31497,547,1.74,10096,null,{"$f":"IFERROR( RANK(F139,$F$2:$F$500,0)+COUNTIF($F$2:F139,F139)-1, \"\")","v":163},163,"PETRONET"]
["GODREJPROP",48777,47967,810,1.69,17080,null,{"$f":"IFERROR( RANK(F140,$F$2:$F$500,0)+COUNTIF($F$2:F140,F140)-1, \"\")","v":107},107,"GODREJPROP"]
["CONCOR",28996,28526,470,1.65,5733,null,{"$f":"IFERROR( RANK(F141,$F$2:$F$500,0)+COUNTIF($F$2:F141,F141)-1, \"\")","v":193},193,"CONCOR"]
["CDSL",42012,41343,669,1.62,23920,null,{"$f":"IFERROR( RANK(F142,$F$2:$F$500,0)+COUNTIF($F$2:F142,F142)-1, \"\")","v":81},81,"CDSL"]
["TATATECH",13639,13422,217,1.62,2768,null,{"$f":"IFERROR( RANK(F143,$F$2:$F$500,0)+COUNTIF($F$2:F143,F143)-1, \"\")","v":212},212,"TATATECH"]
["DELHIVERY",20194,19878,316,1.59,6368,null,{"$f":"IFERROR( RANK(F144,$F$2:$F$500,0)+COUNTIF($F$2:F144,F144)-1, \"\")","v":184},184,"DELHIVERY"]
["BAJAJFINSV",73850,72735,1115,1.53,19400,null,{"$f":"IFERROR( RANK(F145,$F$2:$F$500,0)+COUNTIF($F$2:F145,F145)-1, \"\")","v":100},100,"BAJAJFINSV"]
["MAZDOCK",50209,49459,750,1.52,45750,null,{"$f":"IFERROR( RANK(F146,$F$2:$F$500,0)+COUNTIF($F$2:F146,F146)-1, \"\")","v":41},41,"MAZDOCK"]
["ABCAPITAL",20018,19723,295,1.5,7708,null,{"$f":"IFERROR( RANK(F147,$F$2:$F$500,0)+COUNTIF($F$2:F147,F147)-1, \"\")","v":176},176,"ABCAPITAL"]
["BHARATFORG",25867,25496,371,1.46,17119,null,{"$f":"IFERROR( RANK(F148,$F$2:$F$500,0)+COUNTIF($F$2:F148,F148)-1, \"\")","v":106},106,"BHARATFORG"]
["SUPREMEIND",17060,16828,232,1.38,5627,null,{"$f":"IFERROR( RANK(F149,$F$2:$F$500,0)+COUNTIF($F$2:F149,F149)-1, \"\")","v":194},194,"SUPREMEIND"]
["TATASTEEL",69424,68493,931,1.36,39695,null,{"$f":"IFERROR( RANK(F150,$F$2:$F$500,0)+COUNTIF($F$2:F150,F150)-1, \"\")","v":49},49,"TATASTEEL"]
["UPL",34232,33779,453,1.34,10849,null,{"$f":"IFERROR( RANK(F151,$F$2:$F$500,0)+COUNTIF($F$2:F151,F151)-1, \"\")","v":152},152,"UPL"]
["YESBANK",54472,53756,716,1.33,14960,null,{"$f":"IFERROR( RANK(F152,$F$2:$F$500,0)+COUNTIF($F$2:F152,F152)-1, \"\")","v":119},119,"YESBANK"]
["MAXHEALTH",40904,40367,537,1.33,28808,null,{"$f":"IFERROR( RANK(F153,$F$2:$F$500,0)+COUNTIF($F$2:F153,F153)-1, \"\")","v":68},68,"MAXHEALTH"]
["TVSMOTOR",61885,61154,731,1.2,19829,null,{"$f":"IFERROR( RANK(F154,$F$2:$F$500,0)+COUNTIF($F$2:F154,F154)-1, \"\")","v":98},98,"TVSMOTOR"]
["NIFTYNXT50",949,938,11,1.17,360,null,{"$f":"IFERROR( RANK(F155,$F$2:$F$500,0)+COUNTIF($F$2:F155,F155)-1, \"\")","v":217},217,"NIFTYNXT50"]
["SRF",34354,33957,397,1.17,20066,null,{"$f":"IFERROR( RANK(F156,$F$2:$F$500,0)+COUNTIF($F$2:F156,F156)-1, \"\")","v":96},96,"SRF"]
["IDFCFIRSTB",67908,67154,754,1.1200000000000001,16734,null,{"$f":"IFERROR( RANK(F157,$F$2:$F$500,0)+COUNTIF($F$2:F157,F157)-1, \"\")","v":108},108,"IDFCFIRSTB"]
["LODHA",75790,74952,838,1.1200000000000001,32987,null,{"$f":"IFERROR( RANK(F158,$F$2:$F$500,0)+COUNTIF($F$2:F158,F158)-1, \"\")","v":60},60,"LODHA"]
["APOLLOHOSP",32147,31794,353,1.1100000000000001,18660,null,{"$f":"IFERROR( RANK(F159,$F$2:$F$500,0)+COUNTIF($F$2:F159,F159)-1, \"\")","v":102},102,"APOLLOHOSP"]
["KFINTECH",11130,11010,120,1.0900000000000001,4718,null,{"$f":"IFERROR( RANK(F160,$F$2:$F$500,0)+COUNTIF($F$2:F160,F160)-1, \"\")","v":199},199,"KFINTECH"]
["TATAELXSI",28715,28420,295,1.04,10416,null,{"$f":"IFERROR( RANK(F161,$F$2:$F$500,0)+COUNTIF($F$2:F161,F161)-1, \"\")","v":159},159,"TATAELXSI"]
["PATANJALI",43985,43543,442,1.02,7176,null,{"$f":"IFERROR( RANK(F162,$F$2:$F$500,0)+COUNTIF($F$2:F162,F162)-1, \"\")","v":181},181,"PATANJALI"]
["GLENMARK",34751,34410,341,0.99,19385,null,{"$f":"IFERROR( RANK(F163,$F$2:$F$500,0)+COUNTIF($F$2:F163,F163)-1, \"\")","v":101},101,"GLENMARK"]
["TIINDIA",16006,15849,157,0.99,1808,null,{"$f":"IFERROR( RANK(F164,$F$2:$F$500,0)+COUNTIF($F$2:F164,F164)-1, \"\")","v":214},214,"TIINDIA"]
["COLPAL",40874,40485,389,0.96,10516,null,{"$f":"IFERROR( RANK(F165,$F$2:$F$500,0)+COUNTIF($F$2:F165,F165)-1, \"\")","v":157},157,"COLPAL"]
["OFSS",31787,31498,289,0.92,9552,null,{"$f":"IFERROR( RANK(F166,$F$2:$F$500,0)+COUNTIF($F$2:F166,F166)-1, \"\")","v":169},169,"OFSS"]
["HAL",92535,91701,834,0.91,44864,null,{"$f":"IFERROR( RANK(F167,$F$2:$F$500,0)+COUNTIF($F$2:F167,F167)-1, \"\")","v":43},43,"HAL"]
["PHOENIXLTD",14387,14261,126,0.88,2938,null,{"$f":"IFERROR( RANK(F168,$F$2:$F$500,0)+COUNTIF($F$2:F168,F168)-1, \"\")","v":210},210,"PHOENIXLTD"]
["M&M",137063,135916,1147,0.84,65084,null,{"$f":"IFERROR( RANK(F169,$F$2:$F$500,0)+COUNTIF($F$2:F169,F169)-1, \"\")","v":30},30,"M&M"]
["RECLTD",80040,79372,668,0.84,24445,null,{"$f":"IFERROR( RANK(F170,$F$2:$F$500,0)+COUNTIF($F$2:F170,F170)-1, \"\")","v":79},79,"RECLTD"]
["BANKBARODA",60484,60009,475,0.79,27992,null,{"$f":"IFERROR( RANK(F171,$F$2:$F$500,0)+COUNTIF($F$2:F171,F171)-1, \"\")","v":69},69,"BANKBARODA"]
["SUNPHARMA",96148,95424,724,0.76,56653,null,{"$f":"IFERROR( RANK(F172,$F$2:$F$500,0)+COUNTIF($F$2:F172,F172)-1, \"\")","v":35},35,"SUNPHARMA"]
["KAYNES",57659,57234,425,0.74,33987,null,{"$f":"IFERROR( RANK(F173,$F$2:$F$500,0)+COUNTIF($F$2:F173,F173)-1, \"\")","v":59},59,"KAYNES"]
["IDEA",124426,123521,905,0.73,24754,null,{"$f":"IFERROR( RANK(F174,$F$2:$F$500,0)+COUNTIF($F$2:F174,F174)-1, \"\")","v":78},78,"IDEA"]
["BDL",25819,25632,187,0.73,13586,null,{"$f":"IFERROR( RANK(F175,$F$2:$F$500,0)+COUNTIF($F$2:F175,F175)-1, \"\")","v":127},127,"BDL"]
["POLYCAB",31401,31175,226,0.72,25560,null,{"$f":"IFERROR( RANK(F176,$F$2:$F$500,0)+COUNTIF($F$2:F176,F176)-1, \"\")","v":74},74,"POLYCAB"]
["MFSL",29370,29159,211,0.72,3983,null,{"$f":"IFERROR( RANK(F177,$F$2:$F$500,0)+COUNTIF($F$2:F177,F177)-1, \"\")","v":202},202,"MFSL"]
["TITAN",90722,90105,617,0.68,37477,null,{"$f":"IFERROR( RANK(F178,$F$2:$F$500,0)+COUNTIF($F$2:F178,F178)-1, \"\")","v":54},54,"TITAN"]
["IRFC",28858,28671,187,0.65,10866,null,{"$f":"IFERROR( RANK(F179,$F$2:$F$500,0)+COUNTIF($F$2:F179,F179)-1, \"\")","v":151},151,"IRFC"]
["NYKAA",18572,18459,113,0.61,2974,null,{"$f":"IFERROR( RANK(F180,$F$2:$F$500,0)+COUNTIF($F$2:F180,F180)-1, \"\")","v":209},209,"NYKAA"]
["HINDZINC",54647,54316,331,0.61,15523,null,{"$f":"IFERROR( RANK(F181,$F$2:$F$500,0)+COUNTIF($F$2:F181,F181)-1, \"\")","v":117},117,"HINDZINC"]
["LICHSGFIN",43282,43027,255,0.59,9303,null,{"$f":"IFERROR( RANK(F182,$F$2:$F$500,0)+COUNTIF($F$2:F182,F182)-1, \"\")","v":172},172,"LICHSGFIN"]
["NBCC",16542,16453,89,0.54,3000,null,{"$f":"IFERROR( RANK(F183,$F$2:$F$500,0)+COUNTIF($F$2:F183,F183)-1, \"\")","v":207},207,"NBCC"]
["NAUKRI",37555,37374,181,0.48,11724,null,{"$f":"IFERROR( RANK(F184,$F$2:$F$500,0)+COUNTIF($F$2:F184,F184)-1, \"\")","v":142},142,"NAUKRI"]
["VEDL",88803,88491,312,0.35,60339,null,{"$f":"IFERROR( RANK(F185,$F$2:$F$500,0)+COUNTIF($F$2:F185,F185)-1, \"\")","v":32},32,"VEDL"]
["BHARTIARTL",158336,157790,546,0.35,69411,null,{"$f":"IFERROR( RANK(F186,$F$2:$F$500,0)+COUNTIF($F$2:F186,F186)-1, \"\")","v":26},26,"BHARTIARTL"]
["DRREDDY",37804,37674,130,0.35,15962,null,{"$f":"IFERROR( RANK(F187,$F$2:$F$500,0)+COUNTIF($F$2:F187,F187)-1, \"\")","v":115},115,"DRREDDY"]
["AUBANK",36199,36076,123,0.34,11427,null,{"$f":"IFERROR( RANK(F188,$F$2:$F$500,0)+COUNTIF($F$2:F188,F188)-1, \"\")","v":148},148,"AUBANK"]
["AMBUJACEM",75829,75595,234,0.31,14352,null,{"$f":"IFERROR( RANK(F189,$F$2:$F$500,0)+COUNTIF($F$2:F189,F189)-1, \"\")","v":123},123,"AMBUJACEM"]
["DMART",49016,48873,143,0.28999999999999998,32267,null,{"$f":"IFERROR( RANK(F190,$F$2:$F$500,0)+COUNTIF($F$2:F190,F190)-1, \"\")","v":61},61,"DMART"]
["JSWSTEEL",93424,93162,262,0.28000000000000003,11651,null,{"$f":"IFERROR( RANK(F191,$F$2:$F$500,0)+COUNTIF($F$2:F191,F191)-1, \"\")","v":145},145,"JSWSTEEL"]
["SBIN",202184,201650,534,0.26,164411,null,{"$f":"IFERROR( RANK(F192,$F$2:$F$500,0)+COUNTIF($F$2:F192,F192)-1, \"\")","v":6},6,"SBIN"]
["SHREECEM",19710,19659,51,0.26,3802,null,{"$f":"IFERROR( RANK(F193,$F$2:$F$500,0)+COUNTIF($F$2:F193,F193)-1, \"\")","v":203},203,"SHREECEM"]
["SIEMENS",24291,24235,56,0.23,22719,null,{"$f":"IFERROR( RANK(F194,$F$2:$F$500,0)+COUNTIF($F$2:F194,F194)-1, \"\")","v":83},83,"SIEMENS"]
["ADANIPORTS",75297,75140,157,0.21,40778,null,{"$f":"IFERROR( RANK(F195,$F$2:$F$500,0)+COUNTIF($F$2:F195,F195)-1, \"\")","v":48},48,{"$f":"IFERROR( IF(AND(I195<>\"\", A195<>\"NIFTY\", A195<>\"BANKNIFTY\", A195<>\"MIDCPNIFTY\", A195<>\"FINNIFTY\" ), A195, \"\"), \"\")","v":"ADANIPORTS"}]
["CUMMINSIND",28294,28240,54,0.19,20900,null,{"$f":"IFERROR( RANK(F196,$F$2:$F$500,0)+COUNTIF($F$2:F196,F196)-1, \"\")","v":92},{"$f":"IFERROR( IF(AND(H196<>\"\", A196<>\"NIFTY\", A196<>\"BANKNIFTY\", A196<>\"MIDCPNIFTY\", A196<>\"FINNIFTY\" ), H196, \"\"), \"\")","v":92},"CUMMINSIND"]
["PNB",54258,54156,102,0.19,20839,null,{"$f":"IFERROR( RANK(F197,$F$2:$F$500,0)+COUNTIF($F$2:F197,F197)-1, \"\")","v":94},94,"PNB"]
["PAYTM",38173,38106,67,0.18,15650,null,{"$f":"IFERROR( RANK(F198,$F$2:$F$500,0)+COUNTIF($F$2:F198,F198)-1, \"\")","v":116},116,"PAYTM"]
["PNBHOUSING",24603,24564,39,0.16,4479,null,{"$f":"IFERROR( RANK(F199,$F$2:$F$500,0)+COUNTIF($F$2:F199,F199)-1, \"\")","v":201},201,"PNBHOUSING"]
["DIVISLAB",42059,42103,-44,-0.1,17129,null,{"$f":"IFERROR( RANK(F200,$F$2:$F$500,0)+COUNTIF($F$2:F200,F200)-1, \"\")","v":105},105,"DIVISLAB"]
["PAGEIND",31451,31505,-54,-0.17,10023,null,{"$f":"IFERROR( RANK(F201,$F$2:$F$500,0)+COUNTIF($F$2:F201,F201)-1, \"\")","v":164},164,"PAGEIND"]
["INDUSINDBK",71926,72082,-156,-0.22,19749,null,{"$f":"IFERROR( RANK(F202,$F$2:$F$500,0)+COUNTIF($F$2:F202,F202)-1, \"\")","v":99},99,"INDUSINDBK"]
["MPHASIS",24765,24824,-59,-0.24,7033,null,{"$f":"IFERROR( RANK(F203,$F$2:$F$500,0)+COUNTIF($F$2:F203,F203)-1, \"\")","v":183},183,"MPHASIS"]
["SAMMAANCAP",32718,32811,-93,-0.28000000000000003,299,null,{"$f":"IFERROR( RANK(F204,$F$2:$F$500,0)+COUNTIF($F$2:F204,F204)-1, \"\")","v":218},218,"SAMMAANCAP"]
["GRASIM",67064,67309,-245,-0.36,9312,null,{"$f":"IFERROR( RANK(F205,$F$2:$F$500,0)+COUNTIF($F$2:F205,F205)-1, \"\")","v":171},171,"GRASIM"]
["LAURUSLABS",31225,31347,-122,-0.39,8736,null,{"$f":"IFERROR( RANK(F206,$F$2:$F$500,0)+COUNTIF($F$2:F206,F206)-1, \"\")","v":173},173,"LAURUSLABS"]
["KALYANKJIL",30608,30774,-166,-0.54,9632,null,{"$f":"IFERROR( RANK(F207,$F$2:$F$500,0)+COUNTIF($F$2:F207,F207)-1, \"\")","v":167},167,"KALYANKJIL"]
["SAIL",48071,48439,-368,-0.76,782,null,{"$f":"IFERROR( RANK(F208,$F$2:$F$500,0)+COUNTIF($F$2:F208,F208)-1, \"\")","v":216},216,"SAIL"]
["COFORGE",82423,83056,-633,-0.76,31110,null,{"$f":"IFERROR( RANK(F209,$F$2:$F$500,0)+COUNTIF($F$2:F209,F209)-1, \"\")","v":64},64,"COFORGE"]
["CAMS",14494,14643,-149,-1.02,6334,null,{"$f":"IFERROR( RANK(F210,$F$2:$F$500,0)+COUNTIF($F$2:F210,F210)-1, \"\")","v":185},185,"CAMS"]
["RBLBANK",37889,38327,-438,-1.1399999999999999,16554,null,{"$f":"IFERROR( RANK(F211,$F$2:$F$500,0)+COUNTIF($F$2:F211,F211)-1, \"\")","v":111},111,"RBLBANK"]
["MARICO",28045,28376,-331,-1.17,6322,null,{"$f":"IFERROR( RANK(F212,$F$2:$F$500,0)+COUNTIF($F$2:F212,F212)-1, \"\")","v":186},186,"MARICO"]
["BRITANNIA",32333,32721,-388,-1.19,12298,null,{"$f":"IFERROR( RANK(F213,$F$2:$F$500,0)+COUNTIF($F$2:F213,F213)-1, \"\")","v":132},132,"BRITANNIA"]
["VOLTAS",56680,57365,-685,-1.19,83841,null,{"$f":"IFERROR( RANK(F214,$F$2:$F$500,0)+COUNTIF($F$2:F214,F214)-1, \"\")","v":18},18,"VOLTAS"]
["CROMPTON",32401,32872,-471,-1.43,7048,null,{"$f":"IFERROR( RANK(F215,$F$2:$F$500,0)+COUNTIF($F$2:F215,F215)-1, \"\")","v":182},182,"CROMPTON"]
["BANDHANBNK",36949,37561,-612,-1.63,7315,null,{"$f":"IFERROR( RANK(F216,$F$2:$F$500,0)+COUNTIF($F$2:F216,F216)-1, \"\")","v":180},180,"BANDHANBNK"]
["BOSCHLTD",31256,31907,-651,-2.04,25363,null,{"$f":"IFERROR( RANK(F217,$F$2:$F$500,0)+COUNTIF($F$2:F217,F217)-1, \"\")","v":76},76,"BOSCHLTD"]
["PPLPHARMA",7780,8132,-352,-4.33,4872,null,{"$f":"IFERROR( RANK(F218,$F$2:$F$500,0)+COUNTIF($F$2:F218,F218)-1, \"\")","v":197},197,"PPLPHARMA"]
["PIIND",21578,22799,-1221,-5.36,10661,null,{"$f":"IFERROR( RANK(F219,$F$2:$F$500,0)+COUNTIF($F$2:F219,F219)-1, \"\")","v":154},154,"PIIND"]
[null,null,null,null,null,null,null,{"$f":"IFERROR( RANK(F220,$F$2:$F$500,0)+COUNTIF($F$2:F220,F220)-1, \"\")","v":""},"",""]
[null,null,null,null,null,null,null,{"$f":"IFERROR( RANK(F221,$F$2:$F$500,0)+COUNTIF($F$2:F221,F221)-1, \"\")","v":""},"",""]
[null,null,null,null,null,null,null,{"$f":"IFERROR( RANK(F222,$F$2:$F$500,0)+COUNTIF($F$2:F222,F222)-1, \"\")","v":""},"",""]
[null,null,null,null,null,null,null,{"$f":"IFERROR( RANK(F223,$F$2:$F$500,0)+COUNTIF($F$2:F223,F223)-1, \"\")","v":""},"",""]
[null,null,null,null,null,null,null,{"$f":"IFERROR( RANK(F224,$F$2:$F$500,0)+COUNTIF($F$2:F224,F224)-1, \"\")","v":""},"",""]
[null,null,null,null,null,null,null,{"$f":"IFERROR( RANK(F225,$F$2:$F$500,0)+COUNTIF($F$2:F225,F225)-1, \"\")","v":""},"",""]
[null,null,null,null,null,null,null,{"$f":"IFERROR( RANK(F226,$F$2:$F$500,0)+COUNTIF($F$2:F226,F226)-1, \"\")","v":""},"",""]
[null,null,null,null,null,null,null,{"$f":"IFERROR( RANK(F227,$F$2:$F$500,0)+COUNTIF($F$2:F227,F227)-1, \"\")","v":""},"",""]
[null,null,null,null,null,null,null,{"$f":"IFERROR( RANK(F228,$F$2:$F$500,0)+COUNTIF($F$2:F228,F228)-1, \"\")","v":""},"",""]
[null,null,null,null,null,null,null,{"$f":"IFERROR( RANK(F229,$F$2:$F$500,0)+COUNTIF($F$2:F229,F229)-1, \"\")","v":""},"",""]
[null,null,null,null,null,null,null,{"$f":"IFERROR( RANK(F230,$F$2:$F$500,0)+COUNTIF($F$2:F230,F230)-1, \"\")","v":""},"",""]
[null,null,null,null,null,null,null,{"$f":"IFERROR( RANK(F231,$F$2:$F$500,0)+COUNTIF($F$2:F231,F231)-1, \"\")","v":""},"",""]
[null,null,null,null,null,null,null,{"$f":"IFERROR( RANK(F232,$F$2:$F$500,0)+COUNTIF($F$2:F232,F232)-1, \"\")","v":""},"",""]
[null,null,null,null,null,null,null,{"$f":"IFERROR( RANK(F233,$F$2:$F$500,0)+COUNTIF($F$2:F233,F233)-1, \"\")","v":""},"",""]
[null,null,null,null,null,null,null,{"$f":"IFERROR( RANK(F234,$F$2:$F$500,0)+COUNTIF($F$2:F234,F234)-1, \"\")","v":""},"",""]
[null,null,null,null,null,null,null,{"$f":"IFERROR( RANK(F235,$F$2:$F$500,0)+COUNTIF($F$2:F235,F235)-1, \"\")","v":""},"",""]
[null,null,null,null,null,null,null,{"$f":"IFERROR( RANK(F236,$F$2:$F$500,0)+COUNTIF($F$2:F236,F236)-1, \"\")","v":""},"",""]
[null,null,null,null,null,null,null,{"$f":"IFERROR( RANK(F237,$F$2:$F$500,0)+COUNTIF($F$2:F237,F237)-1, \"\")","v":""},"",""]
[null,null,null,null,null,null,null,{"$f":"IFERROR( RANK(F238,$F$2:$F$500,0)+COUNTIF($F$2:F238,F238)-1, \"\")","v":""},"",""]
[null,null,null,null,null,null,null,{"$f":"IFERROR( RANK(F239,$F$2:$F$500,0)+COUNTIF($F$2:F239,F239)-1, \"\")","v":""},"",""]
[null,null,null,null,null,null,null,{"$f":"IFERROR( RANK(F240,$F$2:$F$500,0)+COUNTIF($F$2:F240,F240)-1, \"\")","v":""},"",""]
[null,null,null,null,null,null,null,{"$f":"IFERROR( RANK(F241,$F$2:$F$500,0)+COUNTIF($F$2:F241,F241)-1, \"\")","v":""},"",""]
[null,null,null,null,null,null,null,{"$f":"IFERROR( RANK(F242,$F$2:$F$500,0)+COUNTIF($F$2:F242,F242)-1, \"\")","v":""},"",""]
[null,null,null,null,null,null,null,{"$f":"IFERROR( RANK(F243,$F$2:$F$500,0)+COUNTIF($F$2:F243,F243)-1, \"\")","v":""},"",""]
[null,null,null,null,null,null,null,{"$f":"IFERROR( RANK(F244,$F$2:$F$500,0)+COUNTIF($F$2:F244,F244)-1, \"\")","v":""},"",""]
[null,null,null,null,null,null,null,{"$f":"IFERROR( RANK(F245,$F$2:$F$500,0)+COUNTIF($F$2:F245,F245)-1, \"\")","v":""},"",""]
[null,null,null,null,null,null,null,{"$f":"IFERROR( RANK(F246,$F$2:$F$500,0)+COUNTIF($F$2:F246,F246)-1, \"\")","v":""},"",""]
[null,null,null,null,null,null,null,{"$f":"IFERROR( RANK(F247,$F$2:$F$500,0)+COUNTIF($F$2:F247,F247)-1, \"\")","v":""},"",""]
[null,null,null,null,null,null,null,{"$f":"IFERROR( RANK(F248,$F$2:$F$500,0)+COUNTIF($F$2:F248,F248)-1, \"\")","v":""},"",""]
[null,null,null,null,null,null,null,{"$f":"IFERROR( RANK(F249,$F$2:$F$500,0)+COUNTIF($F$2:F249,F249)-1, \"\")","v":""},"",""]
[null,null,null,null,null,null,null,{"$f":"IFERROR( RANK(F250,$F$2:$F$500,0)+COUNTIF($F$2:F250,F250)-1, \"\")","v":""},"",""]
[null,null,null,null,null,null,null,{"$f":"IFERROR( RANK(F251,$F$2:$F$500,0)+COUNTIF($F$2:F251,F251)-1, \"\")","v":""},"",""]
[null,null,null,null,null,null,null,{"$f":"IFERROR( RANK(F252,$F$2:$F$500,0)+COUNTIF($F$2:F252,F252)-1, \"\")","v":""},"",""]
[null,null,null,null,null,null,null,{"$f":"IFERROR( RANK(F253,$F$2:$F$500,0)+COUNTIF($F$2:F253,F253)-1, \"\")","v":""},"",""]
[null,null,null,null,null,null,null,{"$f":"IFERROR( RANK(F254,$F$2:$F$500,0)+COUNTIF($F$2:F254,F254)-1, \"\")","v":""},"",""]
[null,null,null,null,null,null,null,{"$f":"IFERROR( RANK(F255,$F$2:$F$500,0)+COUNTIF($F$2:F255,F255)-1, \"\")","v":""},"",""]
[null,null,null,null,null,null,null,{"$f":"IFERROR( RANK(F256,$F$2:$F$500,0)+COUNTIF($F$2:F256,F256)-1, \"\")","v":""},"",""]
[null,null,null,null,null,null,null,{"$f":"IFERROR( RANK(F257,$F$2:$F$500,0)+COUNTIF($F$2:F257,F257)-1, \"\")","v":""},"",""]
[null,null,null,null,null,null,null,{"$f":"IFERROR( RANK(F258,$F$2:$F$500,0)+COUNTIF($F$2:F258,F258)-1, \"\")","v":""},"",""]
[null,null,null,null,null,null,null,{"$f":"IFERROR( RANK(F259,$F$2:$F$500,0)+COUNTIF($F$2:F259,F259)-1, \"\")","v":""},"",{"$f":"IFERROR( IF(AND(I259<>\"\", A259<>\"NIFTY\", A259<>\"BANKNIFTY\", A259<>\"MIDCPNIFTY\", A259<>\"FINNIFTY\" ), A259, \"\"), \"\")","v":""}]
[null,null,null,null,null,null,null,{"$f":"IFERROR( RANK(F260,$F$2:$F$500,0)+COUNTIF($F$2:F260,F260)-1, \"\")","v":""},{"$f":"IFERROR( IF(AND(H260<>\"\", A260<>\"NIFTY\", A260<>\"BANKNIFTY\", A260<>\"MIDCPNIFTY\", A260<>\"FINNIFTY\" ), H260, \"\"), \"\")","v":""},""]
[null,null,null,null,null,null,null,{"$f":"IFERROR( RANK(F261,$F$2:$F$500,0)+COUNTIF($F$2:F261,F261)-1, \"\")","v":""},"",""]
[null,null,null,null,null,null,null,{"$f":"IFERROR( RANK(F262,$F$2:$F$500,0)+COUNTIF($F$2:F262,F262)-1, \"\")","v":""},"",""]
[null,null,null,null,null,null,null,{"$f":"IFERROR( RANK(F263,$F$2:$F$500,0)+COUNTIF($F$2:F263,F263)-1, \"\")","v":""},"",""]
[null,null,null,null,null,null,null,{"$f":"IFERROR( RANK(F264,$F$2:$F$500,0)+COUNTIF($F$2:F264,F264)-1, \"\")","v":""},"",""]
[null,null,null,null,null,null,null,{"$f":"IFERROR( RANK(F265,$F$2:$F$500,0)+COUNTIF($F$2:F265,F265)-1, \"\")","v":""},"",""]
[null,null,null,null,null,null,null,{"$f":"IFERROR( RANK(F266,$F$2:$F$500,0)+COUNTIF($F$2:F266,F266)-1, \"\")","v":""},"",""]
[null,null,null,null,null,null,null,{"$f":"IFERROR( RANK(F267,$F$2:$F$500,0)+COUNTIF($F$2:F267,F267)-1, \"\")","v":""},"",""]
[null,null,null,null,null,null,null,{"$f":"IFERROR( RANK(F268,$F$2:$F$500,0)+COUNTIF($F$2:F268,F268)-1, \"\")","v":""},"",""]
[null,null,null,null,null,null,null,{"$f":"IFERROR( RANK(F269,$F$2:$F$500,0)+COUNTIF($F$2:F269,F269)-1, \"\")","v":""},"",""]
[null,null,null,null,null,null,null,{"$f":"IFERROR( RANK(F270,$F$2:$F$500,0)+COUNTIF($F$2:F270,F270)-1, \"\")","v":""},"",""]
[null,null,null,null,null,null,null,{"$f":"IFERROR( RANK(F271,$F$2:$F$500,0)+COUNTIF($F$2:F271,F271)-1, \"\")","v":""},"",""]
[null,null,null,null,null,null,null,{"$f":"IFERROR( RANK(F272,$F$2:$F$500,0)+COUNTIF($F$2:F272,F272)-1, \"\")","v":""},"",""]
[null,null,null,null,null,null,null,{"$f":"IFERROR( RANK(F273,$F$2:$F$500,0)+COUNTIF($F$2:F273,F273)-1, \"\")","v":""},"",""]
[null,null,null,null,null,null,null,{"$f":"IFERROR( RANK(F274,$F$2:$F$500,0)+COUNTIF($F$2:F274,F274)-1, \"\")","v":""},"",""]
[null,null,null,null,null,null,null,{"$f":"IFERROR( RANK(F275,$F$2:$F$500,0)+COUNTIF($F$2:F275,F275)-1, \"\")","v":""},"",""]
[null,null,null,null,null,null,null,{"$f":"IFERROR( RANK(F276,$F$2:$F$500,0)+COUNTIF($F$2:F276,F276)-1, \"\")","v":""},"",""]
[null,null,null,null,null,null,null,{"$f":"IFERROR( RANK(F277,$F$2:$F$500,0)+COUNTIF($F$2:F277,F277)-1, \"\")","v":""},"",""]
[null,null,null,null,null,null,null,{"$f":"IFERROR( RANK(F278,$F$2:$F$500,0)+COUNTIF($F$2:F278,F278)-1, \"\")","v":""},"",""]
[null,null,null,null,null,null,null,{"$f":"IFERROR( RANK(F279,$F$2:$F$500,0)+COUNTIF($F$2:F279,F279)-1, \"\")","v":""},"",""]
[null,null,null,null,null,null,null,{"$f":"IFERROR( RANK(F280,$F$2:$F$500,0)+COUNTIF($F$2:F280,F280)-1, \"\")","v":""},"",""]
[null,null,null,null,null,null,null,{"$f":"IFERROR( RANK(F281,$F$2:$F$500,0)+COUNTIF($F$2:F281,F281)-1, \"\")","v":""},"",""]
[null,null,null,null,null,null,null,{"$f":"IFERROR( RANK(F282,$F$2:$F$500,0)+COUNTIF($F$2:F282,F282)-1, \"\")","v":""},"",""]
[null,null,null,null,null,null,null,{"$f":"IFERROR( RANK(F283,$F$2:$F$500,0)+COUNTIF($F$2:F283,F283)-1, \"\")","v":""},"",""]
[null,null,null,null,null,null,null,{"$f":"IFERROR( RANK(F284,$F$2:$F$500,0)+COUNTIF($F$2:F284,F284)-1, \"\")","v":""},"",""]
[null,null,null,null,null,null,null,{"$f":"IFERROR( RANK(F285,$F$2:$F$500,0)+COUNTIF($F$2:F285,F285)-1, \"\")","v":""},"",""]
[null,null,null,null,null,null,null,{"$f":"IFERROR( RANK(F286,$F$2:$F$500,0)+COUNTIF($F$2:F286,F286)-1, \"\")","v":""},"",""]
[null,null,null,null,null,null,null,{"$f":"IFERROR( RANK(F287,$F$2:$F$500,0)+COUNTIF($F$2:F287,F287)-1, \"\")","v":""},"",""]
[null,null,null,null,null,null,null,{"$f":"IFERROR( RANK(F288,$F$2:$F$500,0)+COUNTIF($F$2:F288,F288)-1, \"\")","v":""},"",""]
[null,null,null,null,null,null,null,{"$f":"IFERROR( RANK(F289,$F$2:$F$500,0)+COUNTIF($F$2:F289,F289)-1, \"\")","v":""},"",""]
[null,null,null,null,null,null,null,{"$f":"IFERROR( RANK(F290,$F$2:$F$500,0)+COUNTIF($F$2:F290,F290)-1, \"\")","v":""},"",""]
[null,null,null,null,null,null,null,{"$f":"IFERROR( RANK(F291,$F$2:$F$500,0)+COUNTIF($F$2:F291,F291)-1, \"\")","v":""},"",""]
[null,null,null,null,null,null,null,{"$f":"IFERROR( RANK(F292,$F$2:$F$500,0)+COUNTIF($F$2:F292,F292)-1, \"\")","v":""},"",""]
[null,null,null,null,null,null,null,{"$f":"IFERROR( RANK(F293,$F$2:$F$500,0)+COUNTIF($F$2:F293,F293)-1, \"\")","v":""},"",""]
[null,null,null,null,null,null,null,{"$f":"IFERROR( RANK(F294,$F$2:$F$500,0)+COUNTIF($F$2:F294,F294)-1, \"\")","v":""},"",""]
[null,null,null,null,null,null,null,{"$f":"IFERROR( RANK(F295,$F$2:$F$500,0)+COUNTIF($F$2:F295,F295)-1, \"\")","v":""},"",""]
[null,null,null,null,null,null,null,{"$f":"IFERROR( RANK(F296,$F$2:$F$500,0)+COUNTIF($F$2:F296,F296)-1, \"\")","v":""},"",""]
[null,null,null,null,null,null,null,{"$f":"IFERROR( RANK(F297,$F$2:$F$500,0)+COUNTIF($F$2:F297,F297)-1, \"\")","v":""},"",""]
[null,null,null,null,null,null,null,{"$f":"IFERROR( RANK(F298,$F$2:$F$500,0)+COUNTIF($F$2:F298,F298)-1, \"\")","v":""},"",""]
[null,null,null,null,null,null,null,{"$f":"IFERROR( RANK(F299,$F$2:$F$500,0)+COUNTIF($F$2:F299,F299)-1, \"\")","v":""},"",""]
[null,null,null,null,null,null,null,{"$f":"IFERROR( RANK(F300,$F$2:$F$500,0)+COUNTIF($F$2:F300,F300)-1, \"\")","v":""},"",""]
[null,null,null,null,null,null,null,{"$f":"IFERROR( RANK(F301,$F$2:$F$500,0)+COUNTIF($F$2:F301,F301)-1, \"\")","v":""},"",""]
[null,null,null,null,null,null,null,{"$f":"IFERROR( RANK(F302,$F$2:$F$500,0)+COUNTIF($F$2:F302,F302)-1, \"\")","v":""},"",""]
[null,null,null,null,null,null,null,{"$f":"IFERROR( RANK(F303,$F$2:$F$500,0)+COUNTIF($F$2:F303,F303)-1, \"\")","v":""},"",""]
[null,null,null,null,null,null,null,{"$f":"IFERROR( RANK(F304,$F$2:$F$500,0)+COUNTIF($F$2:F304,F304)-1, \"\")","v":""},"",""]
[null,null,null,null,null,null,null,{"$f":"IFERROR( RANK(F305,$F$2:$F$500,0)+COUNTIF($F$2:F305,F305)-1, \"\")","v":""},"",""]
[null,null,null,null,null,null,null,{"$f":"IFERROR( RANK(F306,$F$2:$F$500,0)+COUNTIF($F$2:F306,F306)-1, \"\")","v":""},"",""]
[null,null,null,null,null,null,null,{"$f":"IFERROR( RANK(F307,$F$2:$F$500,0)+COUNTIF($F$2:F307,F307)-1, \"\")","v":""},"",""]
[null,null,null,null,null,null,null,{"$f":"IFERROR( RANK(F308,$F$2:$F$500,0)+COUNTIF($F$2:F308,F308)-1, \"\")","v":""},"",""]
[null,null,null,null,null,null,null,{"$f":"IFERROR( RANK(F309,$F$2:$F$500,0)+COUNTIF($F$2:F309,F309)-1, \"\")","v":""},"",""]
[null,null,null,null,null,null,null,{"$f":"IFERROR( RANK(F310,$F$2:$F$500,0)+COUNTIF($F$2:F310,F310)-1, \"\")","v":""},"",""]
[null,null,null,null,null,null,null,{"$f":"IFERROR( RANK(F311,$F$2:$F$500,0)+COUNTIF($F$2:F311,F311)-1, \"\")","v":""},"",""]
[null,null,null,null,null,null,null,{"$f":"IFERROR( RANK(F312,$F$2:$F$500,0)+COUNTIF($F$2:F312,F312)-1, \"\")","v":""},"",""]
[null,null,null,null,null,null,null,{"$f":"IFERROR( RANK(F313,$F$2:$F$500,0)+COUNTIF($F$2:F313,F313)-1, \"\")","v":""},"",""]
[null,null,null,null,null,null,null,{"$f":"IFERROR( RANK(F314,$F$2:$F$500,0)+COUNTIF($F$2:F314,F314)-1, \"\")","v":""},"",""]
[null,null,null,null,null,null,null,{"$f":"IFERROR( RANK(F315,$F$2:$F$500,0)+COUNTIF($F$2:F315,F315)-1, \"\")","v":""},"",""]
[null,null,null,null,null,null,null,{"$f":"IFERROR( RANK(F316,$F$2:$F$500,0)+COUNTIF($F$2:F316,F316)-1, \"\")","v":""},"",""]
[null,null,null,null,null,null,null,{"$f":"IFERROR( RANK(F317,$F$2:$F$500,0)+COUNTIF($F$2:F317,F317)-1, \"\")","v":""},"",""]
[null,null,null,null,null,null,null,{"$f":"IFERROR( RANK(F318,$F$2:$F$500,0)+COUNTIF($F$2:F318,F318)-1, \"\")","v":""},"",""]
[null,null,null,null,null,null,null,{"$f":"IFERROR( RANK(F319,$F$2:$F$500,0)+COUNTIF($F$2:F319,F319)-1, \"\")","v":""},"",""]
[null,null,null,null,null,null,null,{"$f":"IFERROR( RANK(F320,$F$2:$F$500,0)+COUNTIF($F$2:F320,F320)-1, \"\")","v":""},"",""]
[null,null,null,null,null,null,null,{"$f":"IFERROR( RANK(F321,$F$2:$F$500,0)+COUNTIF($F$2:F321,F321)-1, \"\")","v":""},"",""]
[null,null,null,null,null,null,null,{"$f":"IFERROR( RANK(F322,$F$2:$F$500,0)+COUNTIF($F$2:F322,F322)-1, \"\")","v":""},"",""]
[null,null,null,null,null,null,null,{"$f":"IFERROR( RANK(F323,$F$2:$F$500,0)+COUNTIF($F$2:F323,F323)-1, \"\")","v":""},"",{"$f":"IFERROR( IF(AND(I323<>\"\", A323<>\"NIFTY\", A323<>\"BANKNIFTY\", A323<>\"MIDCPNIFTY\", A323<>\"FINNIFTY\" ), A323, \"\"), \"\")","v":""}]
[null,null,null,null,null,null,null,{"$f":"IFERROR( RANK(F324,$F$2:$F$500,0)+COUNTIF($F$2:F324,F324)-1, \"\")","v":""},{"$f":"IFERROR( IF(AND(H324<>\"\", A324<>\"NIFTY\", A324<>\"BANKNIFTY\", A324<>\"MIDCPNIFTY\", A324<>\"FINNIFTY\" ), H324, \"\"), \"\")","v":""},""]
[null,null,null,null,null,null,null,{"$f":"IFERROR( RANK(F325,$F$2:$F$500,0)+COUNTIF($F$2:F325,F325)-1, \"\")","v":""},"",""]
[null,null,null,null,null,null,null,{"$f":"IFERROR( RANK(F326,$F$2:$F$500,0)+COUNTIF($F$2:F326,F326)-1, \"\")","v":""},"",""]
[null,null,null,null,null,null,null,{"$f":"IFERROR( RANK(F327,$F$2:$F$500,0)+COUNTIF($F$2:F327,F327)-1, \"\")","v":""},"",""]
[null,null,null,null,null,null,null,{"$f":"IFERROR( RANK(F328,$F$2:$F$500,0)+COUNTIF($F$2:F328,F328)-1, \"\")","v":""},"",""]
[null,null,null,null,null,null,null,{"$f":"IFERROR( RANK(F329,$F$2:$F$500,0)+COUNTIF($F$2:F329,F329)-1, \"\")","v":""},"",""]
[null,null,null,null,null,null,null,{"$f":"IFERROR( RANK(F330,$F$2:$F$500,0)+COUNTIF($F$2:F330,F330)-1, \"\")","v":""},"",""]
[null,null,null,null,null,null,null,{"$f":"IFERROR( RANK(F331,$F$2:$F$500,0)+COUNTIF($F$2:F331,F331)-1, \"\")","v":""},"",""]
[null,null,null,null,null,null,null,{"$f":"IFERROR( RANK(F332,$F$2:$F$500,0)+COUNTIF($F$2:F332,F332)-1, \"\")","v":""},"",""]
[null,null,null,null,null,null,null,{"$f":"IFERROR( RANK(F333,$F$2:$F$500,0)+COUNTIF($F$2:F333,F333)-1, \"\")","v":""},"",""]
[null,null,null,null,null,null,null,{"$f":"IFERROR( RANK(F334,$F$2:$F$500,0)+COUNTIF($F$2:F334,F334)-1, \"\")","v":""},"",""]
[null,null,null,null,null,null,null,{"$f":"IFERROR( RANK(F335,$F$2:$F$500,0)+COUNTIF($F$2:F335,F335)-1, \"\")","v":""},"",""]
[null,null,null,null,null,null,null,{"$f":"IFERROR( RANK(F336,$F$2:$F$500,0)+COUNTIF($F$2:F336,F336)-1, \"\")","v":""},"",""]
[null,null,null,null,null,null,null,{"$f":"IFERROR( RANK(F337,$F$2:$F$500,0)+COUNTIF($F$2:F337,F337)-1, \"\")","v":""},"",""]
[null,null,null,null,null,null,null,{"$f":"IFERROR( RANK(F338,$F$2:$F$500,0)+COUNTIF($F$2:F338,F338)-1, \"\")","v":""},"",""]
[null,null,null,null,null,null,null,{"$f":"IFERROR( RANK(F339,$F$2:$F$500,0)+COUNTIF($F$2:F339,F339)-1, \"\")","v":""},"",""]
[null,null,null,null,null,null,null,{"$f":"IFERROR( RANK(F340,$F$2:$F$500,0)+COUNTIF($F$2:F340,F340)-1, \"\")","v":""},"",""]
[null,null,null,null,null,null,null,{"$f":"IFERROR( RANK(F341,$F$2:$F$500,0)+COUNTIF($F$2:F341,F341)-1, \"\")","v":""},"",""]
[null,null,null,null,null,null,null,{"$f":"IFERROR( RANK(F342,$F$2:$F$500,0)+COUNTIF($F$2:F342,F342)-1, \"\")","v":""},"",""]
[null,null,null,null,null,null,null,{"$f":"IFERROR( RANK(F343,$F$2:$F$500,0)+COUNTIF($F$2:F343,F343)-1, \"\")","v":""},"",""]
[null,null,null,null,null,null,null,{"$f":"IFERROR( RANK(F344,$F$2:$F$500,0)+COUNTIF($F$2:F344,F344)-1, \"\")","v":""},"",""]
[null,null,null,null,null,null,null,{"$f":"IFERROR( RANK(F345,$F$2:$F$500,0)+COUNTIF($F$2:F345,F345)-1, \"\")","v":""},"",""]
[null,null,null,null,null,null,null,{"$f":"IFERROR( RANK(F346,$F$2:$F$500,0)+COUNTIF($F$2:F346,F346)-1, \"\")","v":""},"",""]
[null,null,null,null,null,null,null,{"$f":"IFERROR( RANK(F347,$F$2:$F$500,0)+COUNTIF($F$2:F347,F347)-1, \"\")","v":""},"",""]
[null,null,null,null,null,null,null,{"$f":"IFERROR( RANK(F348,$F$2:$F$500,0)+COUNTIF($F$2:F348,F348)-1, \"\")","v":""},"",""]
[null,null,null,null,null,null,null,{"$f":"IFERROR( RANK(F349,$F$2:$F$500,0)+COUNTIF($F$2:F349,F349)-1, \"\")","v":""},"",""]
[null,null,null,null,null,null,null,{"$f":"IFERROR( RANK(F350,$F$2:$F$500,0)+COUNTIF($F$2:F350,F350)-1, \"\")","v":""},"",""]
[null,null,null,null,null,null,null,{"$f":"IFERROR( RANK(F351,$F$2:$F$500,0)+COUNTIF($F$2:F351,F351)-1, \"\")","v":""},"",""]
[null,null,null,null,null,null,null,{"$f":"IFERROR( RANK(F352,$F$2:$F$500,0)+COUNTIF($F$2:F352,F352)-1, \"\")","v":""},"",""]
[null,null,null,null,null,null,null,{"$f":"IFERROR( RANK(F353,$F$2:$F$500,0)+COUNTIF($F$2:F353,F353)-1, \"\")","v":""},"",""]
[null,null,null,null,null,null,null,{"$f":"IFERROR( RANK(F354,$F$2:$F$500,0)+COUNTIF($F$2:F354,F354)-1, \"\")","v":""},"",""]
[null,null,null,null,null,null,null,{"$f":"IFERROR( RANK(F355,$F$2:$F$500,0)+COUNTIF($F$2:F355,F355)-1, \"\")","v":""},"",""]
[null,null,null,null,null,null,null,{"$f":"IFERROR( RANK(F356,$F$2:$F$500,0)+COUNTIF($F$2:F356,F356)-1, \"\")","v":""},"",""]
[null,null,null,null,null,null,null,{"$f":"IFERROR( RANK(F357,$F$2:$F$500,0)+COUNTIF($F$2:F357,F357)-1, \"\")","v":""},"",""]
[null,null,null,null,null,null,null,{"$f":"IFERROR( RANK(F358,$F$2:$F$500,0)+COUNTIF($F$2:F358,F358)-1, \"\")","v":""},"",""]
[null,null,null,null,null,null,null,{"$f":"IFERROR( RANK(F359,$F$2:$F$500,0)+COUNTIF($F$2:F359,F359)-1, \"\")","v":""},"",""]
[null,null,null,null,null,null,null,{"$f":"IFERROR( RANK(F360,$F$2:$F$500,0)+COUNTIF($F$2:F360,F360)-1, \"\")","v":""},"",""]
[null,null,null,null,null,null,null,{"$f":"IFERROR( RANK(F361,$F$2:$F$500,0)+COUNTIF($F$2:F361,F361)-1, \"\")","v":""},"",""]
[null,null,null,null,null,null,null,{"$f":"IFERROR( RANK(F362,$F$2:$F$500,0)+COUNTIF($F$2:F362,F362)-1, \"\")","v":""},"",""]
[null,null,null,null,null,null,null,{"$f":"IFERROR( RANK(F363,$F$2:$F$500,0)+COUNTIF($F$2:F363,F363)-1, \"\")","v":""},"",""]
[null,null,null,null,null,null,null,{"$f":"IFERROR( RANK(F364,$F$2:$F$500,0)+COUNTIF($F$2:F364,F364)-1, \"\")","v":""},"",""]
[null,null,null,null,null,null,null,{"$f":"IFERROR( RANK(F365,$F$2:$F$500,0)+COUNTIF($F$2:F365,F365)-1, \"\")","v":""},"",""]
[null,null,null,null,null,null,null,{"$f":"IFERROR( RANK(F366,$F$2:$F$500,0)+COUNTIF($F$2:F366,F366)-1, \"\")","v":""},"",""]
[null,null,null,null,null,null,null,{"$f":"IFERROR( RANK(F367,$F$2:$F$500,0)+COUNTIF($F$2:F367,F367)-1, \"\")","v":""},"",""]
[null,null,null,null,null,null,null,{"$f":"IFERROR( RANK(F368,$F$2:$F$500,0)+COUNTIF($F$2:F368,F368)-1, \"\")","v":""},"",""]
[null,null,null,null,null,null,null,{"$f":"IFERROR( RANK(F369,$F$2:$F$500,0)+COUNTIF($F$2:F369,F369)-1, \"\")","v":""},"",""]
[null,null,null,null,null,null,null,{"$f":"IFERROR( RANK(F370,$F$2:$F$500,0)+COUNTIF($F$2:F370,F370)-1, \"\")","v":""},"",""]
[null,null,null,null,null,null,null,{"$f":"IFERROR( RANK(F371,$F$2:$F$500,0)+COUNTIF($F$2:F371,F371)-1, \"\")","v":""},"",""]
[null,null,null,null,null,null,null,{"$f":"IFERROR( RANK(F372,$F$2:$F$500,0)+COUNTIF($F$2:F372,F372)-1, \"\")","v":""},"",""]
[null,null,null,null,null,null,null,{"$f":"IFERROR( RANK(F373,$F$2:$F$500,0)+COUNTIF($F$2:F373,F373)-1, \"\")","v":""},"",""]
[null,null,null,null,null,null,null,{"$f":"IFERROR( RANK(F374,$F$2:$F$500,0)+COUNTIF($F$2:F374,F374)-1, \"\")","v":""},"",""]
[null,null,null,null,null,null,null,{"$f":"IFERROR( RANK(F375,$F$2:$F$500,0)+COUNTIF($F$2:F375,F375)-1, \"\")","v":""},"",""]
[null,null,null,null,null,null,null,{"$f":"IFERROR( RANK(F376,$F$2:$F$500,0)+COUNTIF($F$2:F376,F376)-1, \"\")","v":""},"",""]
[null,null,null,null,null,null,null,{"$f":"IFERROR( RANK(F377,$F$2:$F$500,0)+COUNTIF($F$2:F377,F377)-1, \"\")","v":""},"",""]
[null,null,null,null,null,null,null,{"$f":"IFERROR( RANK(F378,$F$2:$F$500,0)+COUNTIF($F$2:F378,F378)-1, \"\")","v":""},"",""]
[null,null,null,null,null,null,null,{"$f":"IFERROR( RANK(F379,$F$2:$F$500,0)+COUNTIF($F$2:F379,F379)-1, \"\")","v":""},"",""]
[null,null,null,null,null,null,null,{"$f":"IFERROR( RANK(F380,$F$2:$F$500,0)+COUNTIF($F$2:F380,F380)-1, \"\")","v":""},"",""]
[null,null,null,null,null,null,null,{"$f":"IFERROR( RANK(F381,$F$2:$F$500,0)+COUNTIF($F$2:F381,F381)-1, \"\")","v":""},"",""]
[null,null,null,null,null,null,null,{"$f":"IFERROR( RANK(F382,$F$2:$F$500,0)+COUNTIF($F$2:F382,F382)-1, \"\")","v":""},"",""]
[null,null,null,null,null,null,null,{"$f":"IFERROR( RANK(F383,$F$2:$F$500,0)+COUNTIF($F$2:F383,F383)-1, \"\")","v":""},"",""]
[null,null,null,null,null,null,null,{"$f":"IFERROR( RANK(F384,$F$2:$F$500,0)+COUNTIF($F$2:F384,F384)-1, \"\")","v":""},"",""]
[null,null,null,null,null,null,null,{"$f":"IFERROR( RANK(F385,$F$2:$F$500,0)+COUNTIF($F$2:F385,F385)-1, \"\")","v":""},"",""]
[null,null,null,null,null,null,null,{"$f":"IFERROR( RANK(F386,$F$2:$F$500,0)+COUNTIF($F$2:F386,F386)-1, \"\")","v":""},"",""]
[null,null,null,null,null,null,null,{"$f":"IFERROR( RANK(F387,$F$2:$F$500,0)+COUNTIF($F$2:F387,F387)-1, \"\")","v":""},"",{"$f":"IFERROR( IF(AND(I387<>\"\", A387<>\"NIFTY\", A387<>\"BANKNIFTY\", A387<>\"MIDCPNIFTY\", A387<>\"FINNIFTY\" ), A387, \"\"), \"\")","v":""}]
[null,null,null,null,null,null,null,{"$f":"IFERROR( RANK(F388,$F$2:$F$500,0)+COUNTIF($F$2:F388,F388)-1, \"\")","v":""},{"$f":"IFERROR( IF(AND(H388<>\"\", A388<>\"NIFTY\", A388<>\"BANKNIFTY\", A388<>\"MIDCPNIFTY\", A388<>\"FINNIFTY\" ), H388, \"\"), \"\")","v":""},""]
[null,null,null,null,null,null,null,{"$f":"IFERROR( RANK(F389,$F$2:$F$500,0)+COUNTIF($F$2:F389,F389)-1, \"\")","v":""},"",""]
[null,null,null,null,null,null,null,{"$f":"IFERROR( RANK(F390,$F$2:$F$500,0)+COUNTIF($F$2:F390,F390)-1, \"\")","v":""},"",""]
[null,null,null,null,null,null,null,{"$f":"IFERROR( RANK(F391,$F$2:$F$500,0)+COUNTIF($F$2:F391,F391)-1, \"\")","v":""},"",""]
[null,null,null,null,null,null,null,{"$f":"IFERROR( RANK(F392,$F$2:$F$500,0)+COUNTIF($F$2:F392,F392)-1, \"\")","v":""},"",""]
[null,null,null,null,null,null,null,{"$f":"IFERROR( RANK(F393,$F$2:$F$500,0)+COUNTIF($F$2:F393,F393)-1, \"\")","v":""},"",""]
[null,null,null,null,null,null,null,{"$f":"IFERROR( RANK(F394,$F$2:$F$500,0)+COUNTIF($F$2:F394,F394)-1, \"\")","v":""},"",""]
[null,null,null,null,null,null,null,{"$f":"IFERROR( RANK(F395,$F$2:$F$500,0)+COUNTIF($F$2:F395,F395)-1, \"\")","v":""},"",""]
[null,null,null,null,null,null,null,{"$f":"IFERROR( RANK(F396,$F$2:$F$500,0)+COUNTIF($F$2:F396,F396)-1, \"\")","v":""},"",""]
[null,null,null,null,null,null,null,{"$f":"IFERROR( RANK(F397,$F$2:$F$500,0)+COUNTIF($F$2:F397,F397)-1, \"\")","v":""},"",""]
[null,null,null,null,null,null,null,{"$f":"IFERROR( RANK(F398,$F$2:$F$500,0)+COUNTIF($F$2:F398,F398)-1, \"\")","v":""},"",""]
[null,null,null,null,null,null,null,{"$f":"IFERROR( RANK(F399,$F$2:$F$500,0)+COUNTIF($F$2:F399,F399)-1, \"\")","v":""},"",""]
[null,null,null,null,null,null,null,{"$f":"IFERROR( RANK(F400,$F$2:$F$500,0)+COUNTIF($F$2:F400,F400)-1, \"\")","v":""},"",""]
[null,null,null,null,null,null,null,{"$f":"IFERROR( RANK(F401,$F$2:$F$500,0)+COUNTIF($F$2:F401,F401)-1, \"\")","v":""},"",""]
[null,null,null,null,null,null,null,{"$f":"IFERROR( RANK(F402,$F$2:$F$500,0)+COUNTIF($F$2:F402,F402)-1, \"\")","v":""},"",""]
[null,null,null,null,null,null,null,{"$f":"IFERROR( RANK(F403,$F$2:$F$500,0)+COUNTIF($F$2:F403,F403)-1, \"\")","v":""},"",""]
[null,null,null,null,null,null,null,{"$f":"IFERROR( RANK(F404,$F$2:$F$500,0)+COUNTIF($F$2:F404,F404)-1, \"\")","v":""},"",""]
[null,null,null,null,null,null,null,{"$f":"IFERROR( RANK(F405,$F$2:$F$500,0)+COUNTIF($F$2:F405,F405)-1, \"\")","v":""},"",""]
[null,null,null,null,null,null,null,{"$f":"IFERROR( RANK(F406,$F$2:$F$500,0)+COUNTIF($F$2:F406,F406)-1, \"\")","v":""},"",""]
[null,null,null,null,null,null,null,{"$f":"IFERROR( RANK(F407,$F$2:$F$500,0)+COUNTIF($F$2:F407,F407)-1, \"\")","v":""},"",""]
[null,null,null,null,null,null,null,{"$f":"IFERROR( RANK(F408,$F$2:$F$500,0)+COUNTIF($F$2:F408,F408)-1, \"\")","v":""},"",""]
[null,null,null,null,null,null,null,{"$f":"IFERROR( RANK(F409,$F$2:$F$500,0)+COUNTIF($F$2:F409,F409)-1, \"\")","v":""},"",""]
[null,null,null,null,null,null,null,{"$f":"IFERROR( RANK(F410,$F$2:$F$500,0)+COUNTIF($F$2:F410,F410)-1, \"\")","v":""},"",""]
[null,null,null,null,null,null,null,{"$f":"IFERROR( RANK(F411,$F$2:$F$500,0)+COUNTIF($F$2:F411,F411)-1, \"\")","v":""},"",""]
[null,null,null,null,null,null,null,{"$f":"IFERROR( RANK(F412,$F$2:$F$500,0)+COUNTIF($F$2:F412,F412)-1, \"\")","v":""},"",""]
[null,null,null,null,null,null,null,{"$f":"IFERROR( RANK(F413,$F$2:$F$500,0)+COUNTIF($F$2:F413,F413)-1, \"\")","v":""},"",""]
[null,null,null,null,null,null,null,{"$f":"IFERROR( RANK(F414,$F$2:$F$500,0)+COUNTIF($F$2:F414,F414)-1, \"\")","v":""},"",""]
[null,null,null,null,null,null,null,{"$f":"IFERROR( RANK(F415,$F$2:$F$500,0)+COUNTIF($F$2:F415,F415)-1, \"\")","v":""},"",""]
[null,null,null,null,null,null,null,{"$f":"IFERROR( RANK(F416,$F$2:$F$500,0)+COUNTIF($F$2:F416,F416)-1, \"\")","v":""},"",""]
[null,null,null,null,null,null,null,{"$f":"IFERROR( RANK(F417,$F$2:$F$500,0)+COUNTIF($F$2:F417,F417)-1, \"\")","v":""},"",""]
[null,null,null,null,null,null,null,{"$f":"IFERROR( RANK(F418,$F$2:$F$500,0)+COUNTIF($F$2:F418,F418)-1, \"\")","v":""},"",""]
[null,null,null,null,null,null,null,{"$f":"IFERROR( RANK(F419,$F$2:$F$500,0)+COUNTIF($F$2:F419,F419)-1, \"\")","v":""},"",""]
[null,null,null,null,null,null,null,{"$f":"IFERROR( RANK(F420,$F$2:$F$500,0)+COUNTIF($F$2:F420,F420)-1, \"\")","v":""},"",""]
[null,null,null,null,null,null,null,{"$f":"IFERROR( RANK(F421,$F$2:$F$500,0)+COUNTIF($F$2:F421,F421)-1, \"\")","v":""},"",""]
[null,null,null,null,null,null,null,{"$f":"IFERROR( RANK(F422,$F$2:$F$500,0)+COUNTIF($F$2:F422,F422)-1, \"\")","v":""},"",""]
[null,null,null,null,null,null,null,{"$f":"IFERROR( RANK(F423,$F$2:$F$500,0)+COUNTIF($F$2:F423,F423)-1, \"\")","v":""},"",""]
[null,null,null,null,null,null,null,{"$f":"IFERROR( RANK(F424,$F$2:$F$500,0)+COUNTIF($F$2:F424,F424)-1, \"\")","v":""},"",""]
[null,null,null,null,null,null,null,{"$f":"IFERROR( RANK(F425,$F$2:$F$500,0)+COUNTIF($F$2:F425,F425)-1, \"\")","v":""},"",""]
[null,null,null,null,null,null,null,{"$f":"IFERROR( RANK(F426,$F$2:$F$500,0)+COUNTIF($F$2:F426,F426)-1, \"\")","v":""},"",""]
[null,null,null,null,null,null,null,{"$f":"IFERROR( RANK(F427,$F$2:$F$500,0)+COUNTIF($F$2:F427,F427)-1, \"\")","v":""},"",""]
[null,null,null,null,null,null,null,{"$f":"IFERROR( RANK(F428,$F$2:$F$500,0)+COUNTIF($F$2:F428,F428)-1, \"\")","v":""},"",""]
[null,null,null,null,null,null,null,{"$f":"IFERROR( RANK(F429,$F$2:$F$500,0)+COUNTIF($F$2:F429,F429)-1, \"\")","v":""},"",""]
[null,null,null,null,null,null,null,{"$f":"IFERROR( RANK(F430,$F$2:$F$500,0)+COUNTIF($F$2:F430,F430)-1, \"\")","v":""},"",""]
[null,null,null,null,null,null,null,{"$f":"IFERROR( RANK(F431,$F$2:$F$500,0)+COUNTIF($F$2:F431,F431)-1, \"\")","v":""},"",""]
[null,null,null,null,null,null,null,{"$f":"IFERROR( RANK(F432,$F$2:$F$500,0)+COUNTIF($F$2:F432,F432)-1, \"\")","v":""},"",""]
[null,null,null,null,null,null,null,{"$f":"IFERROR( RANK(F433,$F$2:$F$500,0)+COUNTIF($F$2:F433,F433)-1, \"\")","v":""},"",""]
[null,null,null,null,null,null,null,{"$f":"IFERROR( RANK(F434,$F$2:$F$500,0)+COUNTIF($F$2:F434,F434)-1, \"\")","v":""},"",""]
[null,null,null,null,null,null,null,{"$f":"IFERROR( RANK(F435,$F$2:$F$500,0)+COUNTIF($F$2:F435,F435)-1, \"\")","v":""},"",""]
[null,null,null,null,null,null,null,{"$f":"IFERROR( RANK(F436,$F$2:$F$500,0)+COUNTIF($F$2:F436,F436)-1, \"\")","v":""},"",""]
[null,null,null,null,null,null,null,{"$f":"IFERROR( RANK(F437,$F$2:$F$500,0)+COUNTIF($F$2:F437,F437)-1, \"\")","v":""},"",""]
[null,null,null,null,null,null,null,{"$f":"IFERROR( RANK(F438,$F$2:$F$500,0)+COUNTIF($F$2:F438,F438)-1, \"\")","v":""},"",""]
[null,null,null,null,null,null,null,{"$f":"IFERROR( RANK(F439,$F$2:$F$500,0)+COUNTIF($F$2:F439,F439)-1, \"\")","v":""},"",""]
[null,null,null,null,null,null,null,{"$f":"IFERROR( RANK(F440,$F$2:$F$500,0)+COUNTIF($F$2:F440,F440)-1, \"\")","v":""},"",""]
[null,null,null,null,null,null,null,{"$f":"IFERROR( RANK(F441,$F$2:$F$500,0)+COUNTIF($F$2:F441,F441)-1, \"\")","v":""},"",""]
[null,null,null,null,null,null,null,{"$f":"IFERROR( RANK(F442,$F$2:$F$500,0)+COUNTIF($F$2:F442,F442)-1, \"\")","v":""},"",""]
[null,null,null,null,null,null,null,{"$f":"IFERROR( RANK(F443,$F$2:$F$500,0)+COUNTIF($F$2:F443,F443)-1, \"\")","v":""},"",""]
[null,null,null,null,null,null,null,{"$f":"IFERROR( RANK(F444,$F$2:$F$500,0)+COUNTIF($F$2:F444,F444)-1, \"\")","v":""},"",""]
[null,null,null,null,null,null,null,{"$f":"IFERROR( RANK(F445,$F$2:$F$500,0)+COUNTIF($F$2:F445,F445)-1, \"\")","v":""},"",""]
[null,null,null,null,null,null,null,{"$f":"IFERROR( RANK(F446,$F$2:$F$500,0)+COUNTIF($F$2:F446,F446)-1, \"\")","v":""},"",""]
[null,null,null,null,null,null,null,{"$f":"IFERROR( RANK(F447,$F$2:$F$500,0)+COUNTIF($F$2:F447,F447)-1, \"\")","v":""},"",""]
[null,null,null,null,null,null,null,{"$f":"IFERROR( RANK(F448,$F$2:$F$500,0)+COUNTIF($F$2:F448,F448)-1, \"\")","v":""},"",""]
[null,null,null,null,null,null,null,{"$f":"IFERROR( RANK(F449,$F$2:$F$500,0)+COUNTIF($F$2:F449,F449)-1, \"\")","v":""},"",""]
[null,null,null,null,null,null,null,{"$f":"IFERROR( RANK(F450,$F$2:$F$500,0)+COUNTIF($F$2:F450,F450)-1, \"\")","v":""},"",""]
[null,null,null,null,null,null,null,{"$f":"IFERROR( RANK(F451,$F$2:$F$500,0)+COUNTIF($F$2:F451,F451)-1, \"\")","v":""},"",{"$f":"IFERROR( IF(AND(I451<>\"\", A451<>\"NIFTY\", A451<>\"BANKNIFTY\", A451<>\"MIDCPNIFTY\", A451<>\"FINNIFTY\" ), A451, \"\"), \"\")","v":""}]
[null,null,null,null,null,null,null,{"$f":"IFERROR( RANK(F452,$F$2:$F$500,0)+COUNTIF($F$2:F452,F452)-1, \"\")","v":""},{"$f":"IFERROR( IF(AND(H452<>\"\", A452<>\"NIFTY\", A452<>\"BANKNIFTY\", A452<>\"MIDCPNIFTY\", A452<>\"FINNIFTY\" ), H452, \"\"), \"\")","v":""},""]
[null,null,null,null,null,null,null,{"$f":"IFERROR( RANK(F453,$F$2:$F$500,0)+COUNTIF($F$2:F453,F453)-1, \"\")","v":""},"",""]
[null,null,null,null,null,null,null,{"$f":"IFERROR( RANK(F454,$F$2:$F$500,0)+COUNTIF($F$2:F454,F454)-1, \"\")","v":""},"",""]
[null,null,null,null,null,null,null,{"$f":"IFERROR( RANK(F455,$F$2:$F$500,0)+COUNTIF($F$2:F455,F455)-1, \"\")","v":""},"",""]
[null,null,null,null,null,null,null,{"$f":"IFERROR( RANK(F456,$F$2:$F$500,0)+COUNTIF($F$2:F456,F456)-1, \"\")","v":""},"",""]
[null,null,null,null,null,null,null,{"$f":"IFERROR( RANK(F457,$F$2:$F$500,0)+COUNTIF($F$2:F457,F457)-1, \"\")","v":""},"",""]
[null,null,null,null,null,null,null,{"$f":"IFERROR( RANK(F458,$F$2:$F$500,0)+COUNTIF($F$2:F458,F458)-1, \"\")","v":""},"",""]
[null,null,null,null,null,null,null,{"$f":"IFERROR( RANK(F459,$F$2:$F$500,0)+COUNTIF($F$2:F459,F459)-1, \"\")","v":""},"",""]
[null,null,null,null,null,null,null,{"$f":"IFERROR( RANK(F460,$F$2:$F$500,0)+COUNTIF($F$2:F460,F460)-1, \"\")","v":""},"",""]
[null,null,null,null,null,null,null,{"$f":"IFERROR( RANK(F461,$F$2:$F$500,0)+COUNTIF($F$2:F461,F461)-1, \"\")","v":""},"",""]
[null,null,null,null,null,null,null,{"$f":"IFERROR( RANK(F462,$F$2:$F$500,0)+COUNTIF($F$2:F462,F462)-1, \"\")","v":""},"",""]
[null,null,null,null,null,null,null,{"$f":"IFERROR( RANK(F463,$F$2:$F$500,0)+COUNTIF($F$2:F463,F463)-1, \"\")","v":""},"",""]
[null,null,null,null,null,null,null,{"$f":"IFERROR( RANK(F464,$F$2:$F$500,0)+COUNTIF($F$2:F464,F464)-1, \"\")","v":""},"",""]
[null,null,null,null,null,null,null,{"$f":"IFERROR( RANK(F465,$F$2:$F$500,0)+COUNTIF($F$2:F465,F465)-1, \"\")","v":""},"",""]
[null,null,null,null,null,null,null,{"$f":"IFERROR( RANK(F466,$F$2:$F$500,0)+COUNTIF($F$2:F466,F466)-1, \"\")","v":""},"",""]
[null,null,null,null,null,null,null,{"$f":"IFERROR( RANK(F467,$F$2:$F$500,0)+COUNTIF($F$2:F467,F467)-1, \"\")","v":""},"",""]
[null,null,null,null,null,null,null,{"$f":"IFERROR( RANK(F468,$F$2:$F$500,0)+COUNTIF($F$2:F468,F468)-1, \"\")","v":""},"",""]
[null,null,null,null,null,null,null,{"$f":"IFERROR( RANK(F469,$F$2:$F$500,0)+COUNTIF($F$2:F469,F469)-1, \"\")","v":""},"",""]
[null,null,null,null,null,null,null,{"$f":"IFERROR( RANK(F470,$F$2:$F$500,0)+COUNTIF($F$2:F470,F470)-1, \"\")","v":""},"",""]
[null,null,null,null,null,null,null,{"$f":"IFERROR( RANK(F471,$F$2:$F$500,0)+COUNTIF($F$2:F471,F471)-1, \"\")","v":""},"",""]
[null,null,null,null,null,null,null,{"$f":"IFERROR( RANK(F472,$F$2:$F$500,0)+COUNTIF($F$2:F472,F472)-1, \"\")","v":""},"",""]
[null,null,null,null,null,null,null,{"$f":"IFERROR( RANK(F473,$F$2:$F$500,0)+COUNTIF($F$2:F473,F473)-1, \"\")","v":""},"",""]
[null,null,null,null,null,null,null,{"$f":"IFERROR( RANK(F474,$F$2:$F$500,0)+COUNTIF($F$2:F474,F474)-1, \"\")","v":""},"",""]
[null,null,null,null,null,null,null,{"$f":"IFERROR( RANK(F475,$F$2:$F$500,0)+COUNTIF($F$2:F475,F475)-1, \"\")","v":""},"",""]
[null,null,null,null,null,null,null,{"$f":"IFERROR( RANK(F476,$F$2:$F$500,0)+COUNTIF($F$2:F476,F476)-1, \"\")","v":""},"",""]
[null,null,null,null,null,null,null,{"$f":"IFERROR( RANK(F477,$F$2:$F$500,0)+COUNTIF($F$2:F477,F477)-1, \"\")","v":""},"",""]
[null,null,null,null,null,null,null,{"$f":"IFERROR( RANK(F478,$F$2:$F$500,0)+COUNTIF($F$2:F478,F478)-1, \"\")","v":""},"",""]
[null,null,null,null,null,null,null,{"$f":"IFERROR( RANK(F479,$F$2:$F$500,0)+COUNTIF($F$2:F479,F479)-1, \"\")","v":""},"",""]
[null,null,null,null,null,null,null,{"$f":"IFERROR( RANK(F480,$F$2:$F$500,0)+COUNTIF($F$2:F480,F480)-1, \"\")","v":""},"",""]
[null,null,null,null,null,null,null,{"$f":"IFERROR( RANK(F481,$F$2:$F$500,0)+COUNTIF($F$2:F481,F481)-1, \"\")","v":""},"",""]
[null,null,null,null,null,null,null,{"$f":"IFERROR( RANK(F482,$F$2:$F$500,0)+COUNTIF($F$2:F482,F482)-1, \"\")","v":""},"",""]
[null,null,null,null,null,null,null,{"$f":"IFERROR( RANK(F483,$F$2:$F$500,0)+COUNTIF($F$2:F483,F483)-1, \"\")","v":""},"",""]
[null,null,null,null,null,null,null,{"$f":"IFERROR( RANK(F484,$F$2:$F$500,0)+COUNTIF($F$2:F484,F484)-1, \"\")","v":""},"",""]
[null,null,null,null,null,null,null,{"$f":"IFERROR( RANK(F485,$F$2:$F$500,0)+COUNTIF($F$2:F485,F485)-1, \"\")","v":""},"",""]
[null,null,null,null,null,null,null,{"$f":"IFERROR( RANK(F486,$F$2:$F$500,0)+COUNTIF($F$2:F486,F486)-1, \"\")","v":""},"",""]
[null,null,null,null,null,null,null,{"$f":"IFERROR( RANK(F487,$F$2:$F$500,0)+COUNTIF($F$2:F487,F487)-1, \"\")","v":""},"",""]
[null,null,null,null,null,null,null,{"$f":"IFERROR( RANK(F488,$F$2:$F$500,0)+COUNTIF($F$2:F488,F488)-1, \"\")","v":""},"",""]
[null,null,null,null,null,null,null,{"$f":"IFERROR( RANK(F489,$F$2:$F$500,0)+COUNTIF($F$2:F489,F489)-1, \"\")","v":""},"",""]
[null,null,null,null,null,null,null,{"$f":"IFERROR( RANK(F490,$F$2:$F$500,0)+COUNTIF($F$2:F490,F490)-1, \"\")","v":""},"",""]
[null,null,null,null,null,null,null,{"$f":"IFERROR( RANK(F491,$F$2:$F$500,0)+COUNTIF($F$2:F491,F491)-1, \"\")","v":""},"",""]
[null,null,null,null,null,null,null,{"$f":"IFERROR( RANK(F492,$F$2:$F$500,0)+COUNTIF($F$2:F492,F492)-1, \"\")","v":""},"",""]
[null,null,null,null,null,null,null,{"$f":"IFERROR( RANK(F493,$F$2:$F$500,0)+COUNTIF($F$2:F493,F493)-1, \"\")","v":""},"",""]
[null,null,null,null,null,null,null,{"$f":"IFERROR( RANK(F494,$F$2:$F$500,0)+COUNTIF($F$2:F494,F494)-1, \"\")","v":""},"",""]
[null,null,null,null,null,null,null,{"$f":"IFERROR( RANK(F495,$F$2:$F$500,0)+COUNTIF($F$2:F495,F495)-1, \"\")","v":""},"",""]
[null,null,null,null,null,null,null,{"$f":"IFERROR( RANK(F496,$F$2:$F$500,0)+COUNTIF($F$2:F496,F496)-1, \"\")","v":""},"",""]
[null,null,null,null,null,null,null,{"$f":"IFERROR( RANK(F497,$F$2:$F$500,0)+COUNTIF($F$2:F497,F497)-1, \"\")","v":""},"",""]
[null,null,null,null,null,null,null,{"$f":"IFERROR( RANK(F498,$F$2:$F$500,0)+COUNTIF($F$2:F498,F498)-1, \"\")","v":""},"",""]
[null,null,null,null,null,null,null,{"$f":"IFERROR( RANK(F499,$F$2:$F$500,0)+COUNTIF($F$2:F499,F499)-1, \"\")","v":""},"",""]
[null,null,null,null,null,null,null,{"$f":"IFERROR( RANK(F500,$F$2:$F$500,0)+COUNTIF($F$2:F500,F500)-1, \"\")","v":""},"",""]
[null,null,null,null,null,null,null,{"$f":"IFERROR( RANK(F501,$F$2:$F$500,0)+COUNTIF($F$2:F501,F501)-1, \"\")","v":""},"",""]

{"sheet":"G","index":5,"n_rows":0,"n_cols":0,"rows_kept":0,"cut":false,"hidden":true,"merged":[]}

{"sheet":"L","index":6,"n_rows":21,"n_cols":4,"rows_kept":21,"cut":false,"hidden":true,"merged":[]}
["symbol","ltp","prev_price","net_price"]
["EICHERMOT",7050,7424,-5.04]
["CHOLAFIN",1505.5,1581.2,-4.79]
["MARUTI",13076,13709,-4.62]
["APLAPOLLO",1978.2,2064.6,-4.18]
["HEROMOTOCO",5245,5466.5,-4.05]
["NAM-INDIA",917,955.25,-4]
["POLICYBZR",1450.1,1509.8,-3.95]
["SWIGGY",265.55,275,-3.44]
["ASHOKLEY",172.2,178.02,-3.27]
["BAJFINANCE",897.05,924.55,-2.97]
["UNITDSPR",1231.2,1268.2,-2.92]
["HYUNDAI",1745,1796.4,-2.86]
["GODFRYPHLP",2041.9,2101.6,-2.84]
["TVSMOTOR",3732.5,3839.9,-2.8]
["HINDPETRO",350.5,360.6,-2.8]
["CUMMINSIND",4997,5138.7,-2.76]
["MOTILALOFS",757.35,778.55,-2.72]
["RELIANCE",1314,1350.2,-2.68]
["HDFCAMC",2550,2619.3000000000002,-2.65]
["INDIGO",4433.8999999999996,4554.2,-2.64]

{"sheet":"Sectors","index":7,"n_rows":136,"n_cols":21,"rows_kept":136,"cut":false,"hidden":true,"merged":[]}
["name","lastPrice","pChange","open","low","name"]
["NIFTY 50",23842.65,-0.86,23589.599999999999,23555.599999999999,"NIFTY 50",null,null,null,null,null,null,null,null,null,null,null,null,{"$f":"LARGE(C:C,1)","v":8.75},{"$f":"VLOOKUP(S2,C:F,4,FALSE)","v":"INDIA VIX"},{"$f":"VLOOKUP(T2,A:B,2,FALSE)","v":20.5}]
["NIFTY NEXT 50",67123.3,-0.77,66038.399999999994,65625.55,"NIFTY NEXT 50",null,null,null,null,null,null,null,null,null,null,null,null,{"$f":"LARGE(C:C,2)","v":0.93},{"$f":"VLOOKUP(S3,C:F,4,FALSE)","v":"NIFTY50 TR 1X INV"},{"$f":"VLOOKUP(T3,A:B,2,FALSE)","v":179.9}]
["NIFTY BANK",55605.05,-0.55000000000000004,54646,54356.2,"NIFTY BANK",null,null,null,null,null,null,null,null,null,null,null,null,{"$f":"LARGE(C:C,3)","v":0.89},"NIFTY50 PR 1X INV",220.05]
["NIFTY FIN SERVICE",26047.5,-0.63,25645.35,25525.05,"NIFTY FIN SERVICE",null,null,null,null,null,null,null,null,null,null,null,null,{"$f":"LARGE(C:C,4)","v":0.42},"NIFTY IND DEFENCE",8334.5]
["NIFTY MID SELECT",13269.45,-1.02,13115.2,13046.65,"NIFTY MID SELECT",null,null,null,null,null,null,null,null,null,null,null,null,{"$f":"LARGE(C:C,5)","v":0.37},"NIFTY IPO",2009.35]
["NIFTY 100",24599.65,-0.85,24314.2,24259.200000000001,"NIFTY 100",null,null,null,null,null,null,null,null,null,null,null,null,{"$f":"LARGE(C:C,6)","v":0.26},"NIFTY CPSE",7142.65]
["NIFTY 200",13473.3,-0.8,13309.45,13268,"NIFTY 200",null,null,null,null,null,null,null,null,null,null,null,null,{"$f":"LARGE(C:C,7)","v":0.06},"NIFTY ENERGY",37195.050000000003]
["NIFTY 500",22179.05,-0.75,21906.15,21816.35,"NIFTY 500",null,null,null,null,null,null,null,null,null,null,null,null,{"$f":"LARGE(C:C,8)","v":0.02},"BHARATBOND-APR31",1427.58]
["NIFTY MIDCAP 50",16326.3,-0.77,16128.65,16020.9,"NIFTY MIDCAP 50",null,null,null,null,null,null,null,null,null,null,null,null,{"$f":"LARGE(C:C,9)","v":0.01},"BHARATBOND-APR30",1573.42]
["NIFTY MIDCAP 100",57513.3,-0.56999999999999995,56676.4,56289.5,"NIFTY MIDCAP 100",null,null,null,null,null,null,null,null,null,null,null,null,{"$f":"LARGE(C:C,10)","v":0.01},"BHARATBOND-APR30",1573.42]
["NIFTY SMLCAP 100",16762,-0.46,16523.599999999999,16338.9,"NIFTY SMLCAP 100"]
["INDIA VIX",20.5,8.75,18.850000000000001,18.18,"INDIA VIX",null,null,null,null,null,null,null,null,null,null,null,null,{"$f":"SMALL(C:C,1)","v":-2.12},{"$f":"VLOOKUP(S13,C:F,4,FALSE)","v":"NIFTY MOBILITY"},21023.599999999999]
["NIFTY MIDCAP 150",21177.599999999999,-0.57999999999999996,20886.3,20729.2,"NIFTY MIDCAP 150",null,null,null,null,null,null,null,null,null,null,null,null,{"$f":"SMALL(C:C,2)","v":-2.09},{"$f":"VLOOKUP(S14,C:F,4,FALSE)","v":"NIFTY AUTO"},26084.55]
["NIFTY SMLCAP 50",8167.5,-0.43,8048.55,7963.95,"NIFTY SMLCAP 50",null,null,null,null,null,null,null,null,null,null,null,null,{"$f":"SMALL(C:C,3)","v":-1.99},"NIFTY TRANS LOGIS",23442.9]
["NIFTY SMLCAP 250",15687.95,-0.41,15462.7,15293.15,"NIFTY SMLCAP 250",null,null,null,null,null,null,null,null,null,null,null,null,{"$f":"SMALL(C:C,4)","v":-1.77},"NIFTY50 TR 2X LEV",17911.8]
["NIFTY MIDSML 400",19146.150000000001,-0.52,18878.95,18715.7,"NIFTY MIDSML 400",null,null,null,null,null,null,null,null,null,null,null,null,{"$f":"SMALL(C:C,5)","v":-1.77},"NIFTY50 TR 2X LEV",17911.8]
["NIFTY500 MULTICAP",15390.6,-0.67,15192.9,15106.95,"NIFTY500 MULTICAP",null,null,null,null,null,null,null,null,null,null,null,null,{"$f":"SMALL(C:C,6)","v":-1.69},"NIFTY GROWSECT 15",10881.6]
["NIFTY LARGEMID250",15778.9,-0.71,15578.7,15502.8,"NIFTY LARGEMID250",null,null,null,null,null,null,null,null,null,null,null,null,{"$f":"SMALL(C:C,7)","v":-1.66},"NIFTY200MOMENTM30",30007.599999999999]
["NIFTY TOTAL MKT",12455.3,-0.72,12298.65,12245.7,"NIFTY TOTAL MKT",null,null,null,null,null,null,null,null,null,null,null,null,{"$f":"SMALL(C:C,8)","v":-1.64},"NIFTY50 USD",8839.2000000000007]
["NIFTY MICROCAP250",21441.55,-0.04,21023.75,20808.900000000001,"NIFTY MICROCAP250",null,null,null,null,null,null,null,null,null,null,null,null,{"$f":"SMALL(C:C,9)","v":-1.61},"NIFTY INTERNET",1161.3]
["NIFTY500 LMS EQL",16957.95,-0.61,16733.2,16619.099999999999,"NIFTY500 LMS EQL",null,null,null,null,null,null,null,null,null,null,null,null,{"$f":"SMALL(C:C,10)","v":-1.49},"NIFTY MNC",30028.55]
["NIFTY FPI 150",1502.8,-0.85,1485.9,1481.7,"NIFTY FPI 150"]
["NIFTY AUTO",26084.55,-2.09,26041.599999999999,25910.45,"NIFTY AUTO"]
["NIFTY FINSRV25 50",28438.799999999999,-0.51,27983.35,27852.55,"NIFTY FINSRV25 50"]
["NIFTY FMCG",47570.400000000001,-1.29,47486.25,47285.35,"NIFTY FMCG"]
["NIFTY IT",30669.8,-1.1599999999999999,30619.75,30402.25,"NIFTY IT"]
["NIFTY MEDIA",1360.4,-0.35,1344.45,1327.5,"NIFTY MEDIA"]
["NIFTY METAL",12329.3,-0.22,12147.75,12104.3,"NIFTY METAL"]
["NIFTY PHARMA",22100.1,-0.28999999999999998,21971.7,21846.05,"NIFTY PHARMA"]
["NIFTY PSU BANK",8713.9,-0.73,8538.9,8451.5,"NIFTY PSU BANK"]
["NIFTY PVT BANK",26702.45,-0.28999999999999998,26232.6,26141.05,"NIFTY PVT BANK"]
["NIFTY REALTY",757.2,-0.27,739.4,729.1,"NIFTY REALTY"]
["NIFTY HEALTHCARE",14154.95,-0.28000000000000003,14055.8,13989.4,"NIFTY HEALTHCARE"]
["NIFTY CONSR DURBL",36303.85,-0.44,35533.949999999997,35478.949999999997,"NIFTY CONSR DURBL"]
["NIFTY OIL AND GAS",11035.9,-1.41,10952.85,10893.55,"NIFTY OIL AND GAS"]
["NIFTY MIDSML HLTH",43193.85,-0.4,42843.1,42447.45,"NIFTY MIDSML HLTH"]
["NIFTY FINSEREXBNK",30233.599999999999,-1.19,29896.1,29675.95,"NIFTY FINSEREXBNK"]
["NIFTY MS FIN SERV",20299.2,-0.56999999999999995,19981.7,19843.5,"NIFTY MS FIN SERV"]
["NIFTY MS IT TELCM",8486.15,-0.43,8380.15,8310.4500000000007,"NIFTY MS IT TELCM"]
["NIFTY CHEMICALS",26995.4,-0.28000000000000003,26590.25,26188.85,"NIFTY CHEMICALS"]
["NIFTY500 HEALTH",18134.5,-0.27,17972.3,17866,"NIFTY500 HEALTH"]
["NIFTY DIV OPPS 50",6017,-0.89,5966.5,5946.1,"NIFTY DIV OPPS 50"]
["NIFTY GROWSECT 15",10881.6,-1.69,10890.65,10847.7,"NIFTY GROWSECT 15"]
["NIFTY100 QUALTY30",5385.85,-1.01,5354.25,5336.15,"NIFTY100 QUALTY30"]
["NIFTY50 VALUE 20",12387.8,-0.37,12244.7,12198.05,"NIFTY50 VALUE 20"]
["NIFTY50 TR 2X LEV",17911.8,-1.77,17528.150000000001,17477.400000000001,"NIFTY50 TR 2X LEV"]
["NIFTY50 PR 2X LEV",11942.3,-1.77,11686.5,11652.65,"NIFTY50 PR 2X LEV"]
["NIFTY50 TR 1X INV",179.9,0.93,181.75,179.4,"NIFTY50 TR 1X INV"]
["NIFTY50 PR 1X INV",220.05,0.89,222.35,219.5,"NIFTY50 PR 1X INV"]
["NIFTY50 DIV POINT",0,0,0,0,"NIFTY50 DIV POINT"]
["NIFTY ALPHA 50",49507.199999999997,-0.64,48757.05,48458.1,"NIFTY ALPHA 50"]
["NIFTY50 EQL WGT",31599,-0.84,31275.7,31237.95,"NIFTY50 EQL WGT"]
["NIFTY100 EQL WGT",32553,-0.78,32110.2,31988.95,"NIFTY100 EQL WGT"]
["NIFTY100 LOWVOL30",19381.05,-0.91,19249.900000000001,19190.05,"NIFTY100 LOWVOL30"]
["NIFTY200 QUALTY30",19525.400000000001,-1.1599999999999999,19437.400000000001,19371.900000000001,"NIFTY200 QUALTY30"]
["NIFTY ALPHALOWVOL",25388.2,-0.99,25173.55,25075.3,"NIFTY ALPHALOWVOL"]
["NIFTY200MOMENTM30",30007.599999999999,-1.66,29768.35,29578.25,"NIFTY200MOMENTM30"]
["NIFTY M150 QLTY50",22441.85,-1.1100000000000001,22287,22087.4,"NIFTY M150 QLTY50"]
["NIFTY200 ALPHA 30",24720.65,-0.74,24364.15,24186.35,"NIFTY200 ALPHA 30"]
["NIFTYM150MOMNTM50",60119.3,-1.1399999999999999,59486.5,59074.75,"NIFTYM150MOMNTM50"]
["NIFTY500MOMENTM50",50841.599999999999,-1.45,50395.45,50115.45,"NIFTY500MOMENTM50"]
["NIFTYMS400 MQ 100",47396.7,-0.65,46770.9,46534.6,"NIFTYMS400 MQ 100"]
["NIFTYSML250MQ 100",41615.65,-0.36,40953.65,40612.949999999997,"NIFTYSML250MQ 100"]
["NIFTY TOP 10 EW",8761.2999999999993,-0.77,8656.75,8652,"NIFTY TOP 10 EW"]
["NIFTY AQL 30",21431.55,-1.33,21362.15,21268.5,"NIFTY AQL 30"]
["NIFTY AQLV 30",19502.849999999999,-1.32,19431.7,19388.599999999999,"NIFTY AQLV 30"]
["NIFTY HIGHBETA 50",3815.15,-0.06,3726.2,3696.3,"NIFTY HIGHBETA 50"]
["NIFTY LOW VOL 50",23784.7,-0.88,23597.7,23519.9,"NIFTY LOW VOL 50"]
["NIFTY QLTY LV 30",15833.35,-1.26,15796.8,15737.8,"NIFTY QLTY LV 30"]
["NIFTY SML250 Q50",23796.25,-0.22,23426.25,23196.55,"NIFTY SML250 Q50"]
["NIFTY TOP 15 EW",9788.1,-1.21,9707.35,9685.35,"NIFTY TOP 15 EW"]
["NIFTY100 ALPHA 30",17438.349999999999,-1.0900000000000001,17219.05,17141.599999999999,"NIFTY100 ALPHA 30"]
["NIFTY200 VALUE 30",15173.85,-0.48,14930.3,14892.05,"NIFTY200 VALUE 30"]
["NIFTY500 EW",13458.45,-0.5,13266.05,13144.4,"NIFTY500 EW"]
["NIFTY MULTI MQ 50",40269.199999999997,-1.1100000000000001,39832.5,39720.699999999997,"NIFTY MULTI MQ 50"]
["NIFTY500 VALUE 50",16044.95,-0.38,15798.65,15753,"NIFTY500 VALUE 50"]
["NIFTY TOP 20 EW",8684.65,-1.08,8614.35,8606.9500000000007,"NIFTY TOP 20 EW"]
["NIFTY500 QLTY50",18531.5,-0.52,18304.3,18239.75,"NIFTY500 QLTY50"]
["NIFTY500 LOWVOL50",21665.95,-0.95,21519.25,21430.6,"NIFTY500 LOWVOL50"]
["NIFTY500 MQVLV50",30292.85,-1.3,30096.85,29875.25,"NIFTY500 MQVLV50"]
["NIFTY50 USD",8839.2000000000007,-1.64,8987.1,8536.2000000000007,"NIFTY50 USD"]
["NIFTY500 FLEXICAP",9486.35,-1.46,9461.2999999999993,9431.4,"NIFTY500 FLEXICAP"]
["NIFTY TMMQ 50",41928.25,-1.05,41443.800000000003,41322.550000000003,"NIFTY TMMQ 50"]
["NIFTY COMMODITIES",9728.2000000000007,-0.27,9590.35,9552.7999999999993,"NIFTY COMMODITIES"]
["NIFTY CONSUMPTION",11080.25,-1.24,10989.25,10972.5,"NIFTY CONSUMPTION"]
["NIFTY CPSE",7142.65,0.26,7061.25,7048.35,"NIFTY CPSE"]
["NIFTY ENERGY",37195.050000000003,0.06,36575.550000000003,36532.400000000001,"NIFTY ENERGY"]
["NIFTY INFRA",9044.0499999999993,-0.8,8908.75,8894.9500000000007,"NIFTY INFRA"]
["NIFTY100 LIQ 15",7083.4,-1.22,7008.9,6982.1,"NIFTY100 LIQ 15"]
["NIFTY MID LIQ 15",15358.65,-0.56999999999999995,15116.2,15063.55,"NIFTY MID LIQ 15"]
["NIFTY MNC",30028.55,-1.49,29986,29807.95,"NIFTY MNC"]
["NIFTY PSE",10162.549999999999,-0.1,10004,9987.35,"NIFTY PSE"]
["NIFTY SERV SECTOR",30706.95,-0.48,30254.85,30213.3,"NIFTY SERV SECTOR"]
["NIFTY100ESGSECLDR",3980.7,-0.82,3935.15,3926,"NIFTY100ESGSECLDR"]
["NIFTY IND DIGITAL",7752.7,-1.17,7710.6,7675.2,"NIFTY IND DIGITAL"]
["NIFTY100 ESG",4819.1499999999996,-0.83,4764.55,4751.8999999999996,"NIFTY100 ESG"]
["NIFTY INDIA MFG",15042.15,-1.08,14921.55,14842.95,"NIFTY INDIA MFG"]
["NIFTY TATA 25 CAP",14488.45,-0.88,14321.05,14299.3,"NIFTY TATA 25 CAP"]
["NIFTY MULTI MFG",15273.9,-1.03,15154.35,15058.3,"NIFTY MULTI MFG"]
["NIFTY MULTI INFRA",13662.1,-0.5,13447,13368.05,"NIFTY MULTI INFRA"]
["NIFTY IND DEFENCE",8334.5,0.42,8147,8074.8,"NIFTY IND DEFENCE"]
["NIFTY IND TOURISM",7201.2,-1.22,7056.85,7033.8,"NIFTY IND TOURISM"]
["NIFTY CAPITAL MKT",4949.25,-0.08,4854.95,4842.45,"NIFTY CAPITAL MKT"]
["NIFTY EV",2885.2,-1.39,2868.2,2843.65,"NIFTY EV"]
["NIFTY NEW CONSUMP",10679.5,-1.31,10557.85,10514.05,"NIFTY NEW CONSUMP"]
["NIFTY CORP MAATR",36291.4,-0.86,35821,35729.050000000003,"NIFTY CORP MAATR"]
["NIFTY MOBILITY",21023.599999999999,-2.12,20912.5,20828.7,"NIFTY MOBILITY"]
["NIFTY100 ENH ESG",4852.95,-0.84,4798.25,4785.55,"NIFTY100 ENH ESG"]
["NIFTY COREHOUSING",14217.75,-0.63,13968.8,13841.6,"NIFTY COREHOUSING"]
["NIFTY HOUSING",11556.05,-0.03,11308.7,11248.7,"NIFTY HOUSING"]
["NIFTY IPO",2009.35,0.37,1965.6,1951.35,"NIFTY IPO"]
["NIFTY MS IND CONS",16984.7,-0.9,16789.25,16638.95,"NIFTY MS IND CONS"]
["NIFTY NONCYC CONS",14259.8,-1.06,14109.6,14092.65,"NIFTY NONCYC CONS"]
["NIFTY RURAL",15008.4,-1.03,14859.5,14778.75,"NIFTY RURAL"]
["NIFTY SHARIAH 25",7648.95,-1.23,7621.2,7601.8,"NIFTY SHARIAH 25"]
["NIFTY TRANS LOGIS",23442.9,-1.99,23319.5,23221.3,"NIFTY TRANS LOGIS"]
["NIFTY50 SHARIAH",4283.7,-0.95,4266.8500000000004,4250.1499999999996,"NIFTY50 SHARIAH"]
["NIFTY500 SHARIAH",6606.2,-0.81,6546.45,6523.05,"NIFTY500 SHARIAH"]
["NIFTY SME EMERGE",13076.05,-0.17,12997.85,12901.55,"NIFTY SME EMERGE"]
["NIFTY INTERNET",1161.3,-1.61,1154.2,1146.8,"NIFTY INTERNET"]
["NIFTY WAVES",1846.85,-0.04,1815.7,1801.25,"NIFTY WAVES"]
["NIFTY INFRALOG",11294.5,-0.32,11074.65,11021.8,"NIFTY INFRALOG"]
["NIFTY RAILWAYSPSU",3042.45,-0.73,2996.3,2965.6,"NIFTY RAILWAYSPSU"]
["NIFTYCONGLOMERATE",14103.85,-1.06,13937.15,13879.85,"NIFTYCONGLOMERATE"]
["NIFTY GS 8 13YR",2968.25,-0.08,2971.31,2961.36,"NIFTY GS 8 13YR"]
["NIFTY GS 10YR",2602.48,-0.16,2607.14,2596.5700000000002,"NIFTY GS 10YR"]
["NIFTY GS 10YR CLN",871.1,-0.17,872.66,869.12,"NIFTY GS 10YR CLN"]
["NIFTY GS 4 8YR",3247.44,-0.01,3248.43,3241.38,"NIFTY GS 4 8YR"]
["NIFTY GS 11 15YR",3240.72,-0.16,3246.63,3233.81,"NIFTY GS 11 15YR"]
["NIFTY GS 15YRPLUS",3441.62,-0.23,3450.41,3432.92,"NIFTY GS 15YRPLUS"]
["NIFTY GS COMPSITE",3048.87,-0.12,3053.31,3042.25,"NIFTY GS COMPSITE"]
["BHARATBOND-APR30",1573.42,0.01,1573.49,1573.42,"BHARATBOND-APR30"]
["BHARATBOND-APR31",1427.58,0.02,1427.52,1427.52,"BHARATBOND-APR31"]
["BHARATBOND-APR32",1292.1600000000001,0.01,1292.1600000000001,1292.1600000000001,"BHARATBOND-APR32"]
["BHARATBOND-APR33",1252.1300000000001,0.01,1252.17,1252.1300000000001,"BHARATBOND-APR33"]

{"sheet":"fut","index":8,"n_rows":35,"n_cols":22,"rows_kept":35,"cut":false,"hidden":true,"merged":[]}
["underlying","lastPrice","pChange","openInterest","underlying"]
["NIFTY",23850,-1.04145056221733,294362,"NIFTY",null,null,null,null,null,null,null,null,null,null,null,null,null,{"$f":"LARGE(C:C,1)","v":9.6815979014037197},{"$f":"VLOOKUP(S2,C:F,3,FALSE)","v":"NIFTYNXT50"},{"$f":"VLOOKUP(T2,A:B,2,FALSE)","v":67349.2},{"$f":"VLOOKUP(T2,A:D,4,FALSE)","v":657}]
["HDFCBANK",795.7,-2.0556376169374602,569050,"HDFCBANK",null,null,null,null,null,null,null,null,null,null,null,null,null,{"$f":"LARGE(C:C,2)","v":3.16516618538021},{"$f":"VLOOKUP(S3,C:F,3,FALSE)","v":"ADANIPOWER"},{"$f":"VLOOKUP(T3,A:B,2,FALSE)","v":182.2},{"$f":"VLOOKUP(T3,A:D,4,FALSE)","v":18011}]
["ICICIBANK",1346.7,1.69145963905459,146862,"ICICIBANK",null,null,null,null,null,null,null,null,null,null,null,null,null,{"$f":"LARGE(C:C,3)","v":2.5305410122163998},"TATAPOWER",411.25,38756]
["BANKNIFTY",55748,-0.58704785545640603,69054,"BANKNIFTY",null,null,null,null,null,null,null,null,null,null,null,null,null,{"$f":"LARGE(C:C,4)","v":2.1091811414391999},"ADANIENT",2139.8000000000002,51771]
["INFY",1276,-1.27659574468085,204213,"INFY",null,null,null,null,null,null,null,null,null,null,null,null,null,{"$f":"LARGE(C:C,5)","v":1.81245074862096},"NTPC",387.6,53616]
["RELIANCE",1318.3,-2.70848708487084,160900,"RELIANCE",null,null,null,null,null,null,null,null,null,null,null,null,null,{"$f":"LARGE(C:C,6)","v":1.69145963905459},"ICICIBANK",1346.7,146862]
["LT",3952.2,-0.34041909372872298,78023,"LT",null,null,null,null,null,null,null,null,null,null,null,null,null,{"$f":"LARGE(C:C,7)","v":0.65231114540225799},"BHEL",287,40326]
["MARUTI",13120,-4.4289044289044197,63675,"MARUTI",null,null,null,null,null,null,null,null,null,null,null,null,null,{"$f":"LARGE(C:C,8)","v":0.29154518950437303},"TMPV",344,67928]
["SBIN",1061.8499999999999,-0.61771725396602495,101000,"SBIN",null,null,null,null,null,null,null,null,null,null,null,null,null,{"$f":"LARGE(C:C,9)","v":0.170030309750868},"AXISBANK",1355,88107]
["TCS",2458.1999999999998,-2.15729979302658,187124,"TCS",null,null,null,null,null,null,null,null,null,null,null,null,null,{"$f":"LARGE(C:C,10)","v":-0.34041909372872298},"LT",3952.2,78023]
["BHEL",287,0.65231114540225799,40326,"BHEL"]
["TATAPOWER",411.25,2.5305410122163998,38756,"TATAPOWER",null,null,null,null,null,null,null,null,null,null,null,null,null,{"$f":"SMALL(C:C,1)","v":-4.4289044289044197},{"$f":"VLOOKUP(S13,C:F,3,FALSE)","v":"MARUTI"},13120,63675]
["TMPV",344,0.29154518950437303,67928,"TMPV",null,null,null,null,null,null,null,null,null,null,null,null,null,{"$f":"SMALL(C:C,2)","v":-2.8325855451646},{"$f":"VLOOKUP(S14,C:F,3,FALSE)","v":"BAJFINANCE"},898.75,93140]
["HINDALCO",979.2,-1.4691084725296799,50997,"HINDALCO",null,null,null,null,null,null,null,null,null,null,null,null,null,{"$f":"SMALL(C:C,3)","v":-2.7643914833961198},"INDIGO",4439,48053]
["AXISBANK",1355,0.170030309750868,88107,"AXISBANK",null,null,null,null,null,null,null,null,null,null,null,null,null,{"$f":"SMALL(C:C,4)","v":-2.70848708487084},"RELIANCE",1318.3,160900]
["KOTAKBANK",373.7,-0.65133590323009405,99055,"KOTAKBANK",null,null,null,null,null,null,null,null,null,null,null,null,null,{"$f":"SMALL(C:C,5)","v":-2.15729979302658},"TCS",2458.1999999999998,187124]
["M&M",3215.2,-1.5614475537321599,85098,"M&M",null,null,null,null,null,null,null,null,null,null,null,null,null,{"$f":"SMALL(C:C,6)","v":-2.0556376169374602},"HDFCBANK",795.7,569050]
["ADANIPOWER",182.2,3.16516618538021,18011,"ADANIPOWER",null,null,null,null,null,null,null,null,null,null,null,null,null,{"$f":"SMALL(C:C,7)","v":-1.5614475537321599},"M&M",3215.2,85098]
["ADANIENT",2139.8000000000002,2.1091811414391999,51771,"ADANIENT",null,null,null,null,null,null,null,null,null,null,null,null,null,{"$f":"SMALL(C:C,8)","v":-1.4691084725296799},"HINDALCO",979.2,50997]
["BAJFINANCE",898.75,-2.8325855451646,93140,"BAJFINANCE",null,null,null,null,null,null,null,null,null,null,null,null,null,{"$f":"SMALL(C:C,9)","v":-1.27659574468085},"INFY",1276,204213]
["INDIGO",4439,-2.7643914833961198,48053,"INDIGO",null,null,null,null,null,null,null,null,null,null,null,null,null,{"$f":"SMALL(C:C,10)","v":-1.2188267313551999},"MIDCPNIFTY",13289.55,21739]
["NTPC",387.6,1.81245074862096,53616,"NTPC"]
["NIFTY",23990,-0.93694899016802302,34386,"NIFTY"]
["MIDCPNIFTY",13289.55,-1.0454245920498499,21739,"MIDCPNIFTY"]
["BANKNIFTY",55980,-0.55778590968842101,11654,"BANKNIFTY"]
["NIFTY",24152.5,-0.89330411732361603,12390,"NIFTY"]
["BANKNIFTY",56305,-0.45472064382219901,2343,"BANKNIFTY"]
["MIDCPNIFTY",13327.25,-0.91079759846837305,851,"MIDCPNIFTY"]
["FINNIFTY",26094.9,-0.73191236832995399,478,"FINNIFTY"]
["NIFTYNXT50",67349.2,-0.61241776631318601,657,"NIFTYNXT50"]
["NIFTYNXT50",67615.8,-0.64711223959022102,70,"NIFTYNXT50"]
["MIDCPNIFTY",13356.4,-1.2188267313551999,54,"MIDCPNIFTY"]
["FINNIFTY",26195.3,-0.74755802762895596,20,"FINNIFTY"]
["NIFTYNXT50",67400,9.6815979014037197,0,"NIFTYNXT50"]